##TITLE=504-63-2
##JCAMPDX= 6.0         $$ Bruker NMR JCAMP-DX V2.0
##DATA TYPE= NMR SPECTRUM
##DATA CLASS= NTUPLES
##ORIGIN= BRUKER
##OWNER= daeby
$$ 1.83.2.2 TOPSPIN		Version 3.1
$$ 2013-04-23 16:58:26.481 +0200  nmr@nmrf492l
$$ Compression mode = diff/dup
##.OBSERVE FREQUENCY= 400.08260052
##.OBSERVE NUCLEUS= ^1H
##.ACQUISITION MODE= SIMULTANEOUS (DQD)
##.ACQUISITION SCHEME= undefined
##.AVERAGES= 32
##.DIGITISER RES= 23
##SPECTROMETER/DATA SYSTEM= spect
##.PULSE SEQUENCE= zg
##.SOLVENT NAME= CDCl3
##.SHIFT REFERENCE= INTERNAL, CDCl3, 1, 13.49487
##AUDIT TRAIL= $$ (NUMBER, WHEN, WHO, WHERE, PROCESS, VERSION, WHAT)
$$ ##TITLE= Audit trail, TOPSPIN		Version 3.1
$$ ##JCAMPDX= 5.01
$$ ##ORIGIN= Bruker BioSpin GmbH
$$ ##OWNER= nmr
$$ $$ /opt/data/daeby/nmr/504-63-2/20/pdata/1/auditp.txt
$$ ##AUDIT TRAIL=  $$ (NUMBER, WHEN, WHO, WHERE, PROCESS, VERSION, WHAT)
(   1,<2013-04-23 16:58:24.929 +0200>,<nmr>,<nmrf492l>,<go>,<TOPSPIN 3.1>,
      <created by zg
	started at 2013-04-23 16:51:29.013 +0200,
	POWCHK enabled, PULCHK disabled,
       configuration hash MD5:
       62 CD E7 62 13 96 18 BD D3 76 DF 34 F8 DB 97 17
       data hash MD5: 32K
       4F 56 4B 23 FF AA 05 66 82 BE A1 44 8E D7 38 DD>)
(   2,<2013-04-23 16:58:25.521 +0200>,<nmr>,<nmrf492l>,<audit>,<TOPSPIN 3.1>,
      <user comment:
       ICON-NMR User ID: daeby
       data hash MD5: 32K
       4F 56 4B 23 FF AA 05 66 82 BE A1 44 8E D7 38 DD>)
(   3,<2013-04-23 16:58:25.530 +0200>,<nmr>,<nmrf492l>,<audit>,<TOPSPIN 3.1>,
      <user comment:
       ICON-NMR User ID: daeby
       data hash MD5: 32K
       4F 56 4B 23 FF AA 05 66 82 BE A1 44 8E D7 38 DD>)
(   4,<2013-04-23 16:58:26.036 +0200>,<nmr>,<nmrf492l>,<proc1d>,<TOPSPIN 3.1>,
      <Start of raw data processing
       ef LB = 1 FT_mod = 6 PKNL = 1 SI = 16K 
       data hash MD5: 16K
       F9 9C 43 36 AD 44 77 5C 16 32 00 B0 27 A4 1E 46>)
(   5,<2013-04-23 16:58:26.154 +0200>,<nmr>,<nmrf492l>,<proc1d>,<TOPSPIN 3.1>,
      <apk 
       data hash MD5: 16K
       B8 43 D3 41 38 5C 28 C1 71 39 45 24 7B 32 BA 07>)
(   6,<2013-04-23 16:58:26.188 +0200>,<nmr>,<nmrf492l>,<proc1d>,<TOPSPIN 3.1>,
      <abs ABSG = 5 
       data hash MD5: 16K
       2D 84 9E 17 97 EA C2 70 B6 47 A9 AA 94 4C ED 8C>)
$$ ##END=
$$ 
$$ $$ hash MD5
$$ $$ 57 05 7E 7D 1F B3 68 56 AF 49 E3 7E 32 76 3A 20
##$RELAX= 
##$RELAX= 
##$RELAX= 
##$RELAX= 
##$RELAX= 
##$RELAX= 
##$RELAX= 
##$RELAX= 
##$RELAX= 
##$RELAX= 
##$RELAX= 
##$RELAX= 
$$ Bruker specific parameters
$$ --------------------------
##$DATPATH= </opt/data/daeby/nmr>
##$EXPNO= 20
##$NAME= <504-63-2>
##$PROCNO= 1
##$ACQT0= -9.54927425515661
##$AMP= (0..31)
100 100 100 100 100 100 100 100 100 100 100 100 100 100 100 100 100 100
100 100 100 100 100 100 100 100 100 100 100 100 100 100
##$AMPCOIL= (0..19)
0 0 0 0 0 0 0 0 0 0 0 0 0 0 0 0 0 0 0 0
##$ANAVPT= -1
##$AQSEQ= 0
##$AQ_mod= 3
##$AUNM= <au_zg>
##$AUTOPOS= <25 >
##$BF1= 400.08
##$BF2= 100.600196
##$BF3= 400.08
##$BF4= 400.08
##$BF5= 400.08
##$BF6= 400.08
$$ [...]
##$TE_STAB= (0..9)
1 1 0 0 0 0 0 0 0 0
##$TL= (0..7)
0 120 120 120 120 120 120 120
##$TUNHIN= 0
##$TUNHOUT= 0
##$TUNXOUT= 0
##$USERA1= <>
##$USERA2= <>
##$USERA3= <>
##$USERA4= <>
##$USERA5= <>
##$V9= 5
##$VALIST= <>
##$VCLIST= <>
##$VD= 0
##$VDLIST= <>
##$VPLIST= <>
##$VTLIST= <>
##$WBST= 1024
##$WBSW= 4
##$XGAIN= (0..3)
0 0 0 0
##$XL= 0
##$YL= 0
##$YMAX_a= 20047147
##$YMIN_a= -17672080
##$ZGOPTNS= <>
##$ZL1= 120
##$ZL2= 120
##$ZL3= 120
##$ZL4= 120
##$ABSF1= 13.49487
##$ABSF2= -0.4948692
##$ABSG= 5
##$ABSL= 3
##$ALPHA= 0
##$AQORDER= 0
##$ASSFAC= 0
##$ASSFACI= 0
##$ASSFACX= 0
##$ASSWID= 0
##$AUNMP= <save_auto_LDAP.pm>
##$AXLEFT= 0
##$AXNAME= <>
##$AXNUC= <1H>
##$AXRIGHT= 0
##$AXTYPE= 0
##$AXUNIT= <>
##$AZFE= 0.1
##$AZFW= 0.1
##$BCFW= 0
##$BC_mod= 0
##$BYTORDP= 0
##$COROFFS= 0
##$CY= 13.5
##$DATMOD= 1
##$DC= 0
##$DFILT= <>
##$DTYPP= 0
##$ERETIC= no
##$F1P= 9
##$F2P= -1
##$FCOR= 0.5
##$FTSIZE= 16384
##$FT_mod= 6
##$GAMMA= 0
##$GB= 0
##$INTBC= 1
##$INTSCL= 1
##$ISEN= 128
##$LB= 1
##$LEV0= 0
##$LPBIN= 0
##$MAXI= 10000
##$MC2= 0
##$MEAN= 0
##$ME_mod= 0
##$MI= 0
##$MddCEXP= no
##$MddCT_SP= no
##$MddF180= no
##$MddLAMBDA= 0
##$MddMEMORY= 0
##$MddMERGE= 0
##$MddNCOMP= 0
##$MddNITER= 0
##$MddNOISE= 0
##$MddPHASE= 0
##$MddSEED= 0
##$MddSRSIZE= 0
##$Mdd_CsALG= 0
##$Mdd_CsLAMBDA= 0
##$Mdd_CsNITER= 0
##$Mdd_CsNORM= 0
##$Mdd_CsZF= 0
##$Mdd_mod= 0
##$NCOEF= 0
##$NC_proc= -5
##$NLEV= 6
##$NOISF1= 4.687435
##$NOISF2= 4.187535
##$NSP= 0
##$NTH_PI= 0
##$NZP= 0
##$OFFSET= 13.49487
##$PC= 1
##$PHC0= 196.4677
##$PHC1= -23.12754
##$PH_mod= 1
##$PKNL= yes
##$PPARMOD= 0
##$PPDIAG= 0
##$PPIPTYP= 0
##$PPMPNUM= 2147483647
##$PPRESOL= 1
##$PSCAL= 0
##$PSIGN= 0
##$PYNMP= <proc.py>
##$REVERSE= no
##$SF= 400.08
##$SI= 16384
##$SIGF1= 3
##$SIGF2= 2
##$SINO= 0
##$SIOLD= 16384
##$SPECTYP= <>
##$SREGLST= <1H.CDCl3>
##$SSB= 0
##$STSI= 16384
##$STSR= 0
##$SW_p= 5597.01492537313
##$SYMM= 0
##$S_DEV= 0
##$TDeff= 32768
##$TDoff= 0
##$TI= <>
##$TILT= no
##$TM1= 0
##$TM2= 0
##$TOPLEV= 0
##$USERP1= <>
##$USERP2= <>
##$USERP3= <>
##$USERP4= <>
##$USERP5= <>
##$WDW= 1
##$XDIM= 16384
##$YMAX_p= 534916657
##$YMIN_p= -90100
##$CURPLOT= <Cups-PDF>
##$CURPRIN= <$Cups-PDF>
##$DFORMAT= <normdp>
##$LAYOUT= <+/layouts.ATP/1D.xwp>
##$LFORMAT= <normlp>
##$PFORMAT= <normpl>
$$ End of Bruker specific parameters
$$ ---------------------------------
##NTUPLES= NMR SPECTRUM
##VAR_NAME=  FREQUENCY,     SPECTRUM/REAL,   SPECTRUM/IMAG
##SYMBOL=    X,             R,               I
##VAR_TYPE=  INDEPENDENT,   DEPENDENT,       DEPENDENT
##VAR_FORM=  AFFN,          ASDF,            ASDF
##VAR_DIM=   16384,         16384,           16384
##UNITS=     HZ,            ARBITRARY UNITS, ARBITRARY UNITS
##FACTOR=    0.341614680503731, 1,           1
##FIRST=     5596.67331069263, 1136,         -1098962
##LAST=      0,             341717,          -1373144
##MIN=       0,             -90100,          0
##MAX=       5596.67331069263, 534916657,    0
$$ Real data points
##PAGE= N=1
##DATA TABLE= (X++(R..R)), XYDATA
$$ [...]
$$ plain form
11797 -5033 -5170 -5345 -1086 421 2089 5080 3152 1824 3236 1928 -788 -6369 -11827 -13472 -10785 -6041
11781 -6041 -695 1882 3862 2933 -1361 -1182 784 4673 8217 8606 8793 4431 -1199 -4071 -5448 -4251
11765 -4251 -2651 -1113 49 -989 -2291 -4035 -6514 -10008 -11320 -8674 -8846 -10591 -9619 -9818 -9234 -6173
11749 -6173 -2602 -4352 -6084 -2525 -3927 -7057 -7081 -4496 -3412 -1903 658 2759 -3454 -8016 -5464
11734 -5464 -1546 771 3310 4470 -94 600 5499 5538 2291 3285 7212 8585 7628 5286 6394 8605 6003
11717 6003 2047 -361 -287 368 1217 -2008 -7201 -8172 -8261 -6498 -1102 4540 7223 5631 2052 -4187 -7973
11700 -7973 -3894 2947 6746 7381 5027 6655 10803 11086 10491 10005 8042 8320 9271 5021 6014 13753
11684 13753 16619 13279 8571 7135 6381 6112 7891 9048 8945 9812 12859 14119 9382 4470 2755
$$ packed form
11797e033j37j75a086D21J668K991j928j328J412j308g88n581n458j645K687M744
11781f041f95A882J980r29a361J79G84L889L544L89J87m362a199k872j377J197
11765d251J600a113D9i89j302j744k479l494j312K646j72j745R72j99N84L061
11749f173b602j750j732b525j402l130k4K585J084J509F58K101c454m562K552
11734e464a546G71K539J160i4F00M899L9B291R94L927J373r57k342J108K211k602
11717F003B047c61P4C68Q49b008n193r71q9J763a102D540K683j592B052d187l786
11700g973c894B947L799O35k354J628M148K83n95m86j963K78R51m250R93P739
11684A3753K866l340m708j436p54k69J779J157j03Q67L047J260m737D470j715
$$ plain form
11669 2755 5516 7429 7988 5386 369 -885 2158 5343 4084 3015 -1415 -4365 -4372 -3528 -5401 -6080 -3549
11652 -3549 -1115 1766 5675 7718 7661 4123 3644 6334 5282 538 -3731 -3624 -924 1580 1318 -1398
11635 -1411 895 3421 5859 5191 2360 2992 8123 11111 7096 1315 -998 370 3787 3159 3825 6416
11619 6416 4655 -1229 -2560 -1277 220 2874 4757 6874 5700 5504 6330 3772 1948 3470 6249
11604 6249 8025 8262 7301 6676 7240 12501 14718 7260 2698 3403 2012 2567 426 -5794 -5058 1551 7672
11587 7672 9201 6558 3856 2144 3061 898 -546 4290 10328 13599 13448 13945 13943 11995 6303 1327 -317
11569 -1862 -2987 -2602 -4432 -9669 -16837 -19569 -18910 -19102 -16077 -13413 -9351 -2201 845 -2349 -2684 910
11552 4409 2458 120 966 5154 6478 1048 -3794 -8605 -11837 -11736 -10164 -4789 -368 1740 101 -604
$$ packed form
11669B755K761J913N59k602C69h85B158L185j259j069a415k950pQ44j873o79K531
11652c549a115A766L909K043n7l538m79K690j052E38c731J07i24A580k62a398
11635a411H95K526K438o68B360O32N131K988m015A315i98C70L417o28O66K591
11619F416j761a229j331a277B20K654J883K117j174j96Q26k558j824J522K779
11604F249J776K37r61o25N64N261K217G260B698P05j391N55D26e794P36A551O121
11587G672J529k643k702j712R17H98e46D290O038L271j51M97kj948n692A327c17
11569a862j125L85j830n237p168k732O59j92L025K664M062b201H45b349l35I10
11552D409j951A20Q46M188J324A048c794m811l232J01J572d789c68A740A01f04
$$ plain form
11535 2996 5162 4357 4382 3430 2313 2876 5025 1554 -2045 -6045 -10709 -7943 -1885 -673 -1326 -769 719
11517 2053 4176 5984 7010 5080 4148 5740 5927 5582 6437 7753 6744 5518 4188 604 -674 -1135
11501 -1135 315 3836 3749 274 -4723 -5953 526 9219 13530 11372 8800 8110 6672 3838 3653 4018 4119
11484 4119 6200 7594 9379 13188 15212 16207 16124 14406 11023 6422 4013 2660 6443 9570 8146
11469 8146 6932 9086 11727 9735 7676 7219 10969 13548 11355 7595 6176 7007 6690 5811 4202 7412
11453 7412 9275 9042 17754 24349 19972 12988 12583 21529 28977 31012 34341 40341 46836 56475 65809
11438 65809 71646 79399 87096 97105 118800 154451 206305 286852 413829 574015 716541 830329
11426 830329 917879 900255 786336 656860 502819 347407 235940 168108 125250 92934
$$ packed form
11535B996K166q05K5r52j117N63K149A554b045m000m664K766a885f73o53N57G19
11517B053K123J808J026j930r32J592J87l45Q55J316j009j226j330F04f74m61
11501a135C15L521q7B74d723j230E26Q693M311k158k572o90j438k834j85L65J01
11484D119K081J394J785L809K024R95q3j718l383m601k409j353L783L127j424
11469H146j214K154K641j992k059m57L750K579k193l760j419Q31l17q79j609L210
11453G412J863k33Q712O595m377o984m05Q946P448K035L329O000O495R639R334
11438F5809N837P753P697J0009K1695L5651N1854Q0547J26977J60186J42526J13788
11426H30329Q7550j7624j13919j29476j54041j55412j11467o7832m2858l2316
$$ plain form
11416 92934 72340 56758 48087 45638 42670 39061 33178 24255 15297 11847 13010 10375 6207 11431
11402 11431 19318 20233 19609 20330 18689 16688 16250 11218 9266 9855 13656 16953 13049 5861 3908 5770
11386 5770 4638 -1907 -10763 -12452 -10022 -9768 -8375 -3065 578 -1492 -2735 -645 1673 1160 481 1695
11370 1695 2579 2476 -670 -4617 -5629 -2208 3603 1361 -4714 -5210 2914 11423 13985 14345 14918 12293
11354 12293 6173 -1945 -4974 -1578 -1065 -1079 2912 9486 11080 8699 5772 4399 3133 -178 -2668
11339 -2668 -3569 -739 4589 7490 6496 6110 7074 3864 -3557 -9687 -11874 -13113 -13204 -11245 -8858 -3868
11322 522 465 2418 2327 -296 -2147 -2277 1583 5151 3297 238 2676 10978 13550 9720 5090 2853 2548
11305 2548 -695 -2576 -3485 -2601 2223 4831 728 -2954 -5458 -10922 -15492 -15240 -11253 -7140 -6778 -9171
$$ packed form
11416I2934k0594j5582q671k449k968l609n883q923q958l450J163k635m168N224
11402A1431P887R15o24P21j641k001m38n032j952N89L801L297l904E861j953J862
11386E770j132a907q856j689K430K54J393c065E78a492j243f45A673n13D81J214
11370A695Q84j03f70l947j012b208C603A361d714m96B914Q509K562L60N73k625
11354A2293o120a945l029a578N13j4B912O574J594k381k927j373j266a78k490
11339b668r01g39D589K901r94l86R64l210c557o130k187j239r1J959K387c868
11322E22n7J953r1b96j851j30A583L568j854B38K438Q302K572l830m630k237l05
11305B548f95j881r09Q84B223K608G28b954k504n464m570K52L987M113L62k393
$$ plain form
11289 -9171 -9098 -5646 -2220 -1154 -3254 -2625 -574 -693 -807 2241 3113 -700 -1063 2985 3723 -709 -3120
11272 -3120 -4601 -6600 -1609 5810 9334 9474 9407 8223 1865 -1412 -2610 -3105 -3227 -3956 -2773 2940
11255 4778 2739 1423 -1015 -1508 5027 10788 12840 15858 15404 6204 -2244 -6199 -5319 1547 10169
11240 10169 14661 14435 12661 6349 224 714 3820 5770 9346 10750 10467 4056 -2624 -3122 1732 8185
11224 8185 11844 15310 15790 10153 3707 4311 4326 3783 4326 5232 6184 7130 9262 11217 10337 8760 10395
11207 10395 11362 13678 15451 14317 9078 711 -4593 -350 7824 7508 4664 925 -4407 -9512 -13509 -12625
11191 -12625 -8326 -6006 -2707 -2377 -4484 -4335 -1468 1861 3381 4659 5830 8203 7042 7911 10204
11176 10204 12648 13697 15085 12816 7761 3875 2078 -429 1088 4837 7761 9223 7360 6770 6669
$$ packed form
11289i171P3L452b220J066k100O29e74j19j14B241Q72g00l63B985P38g09k411
11272c120j481j999a609E810L524J40o7j184A865a412j198m95j22p29J183B940
11255D778k039j316a015m93E027N761K052L018m54F204b244l955Q80A547Q622
11240A0169M492k26j774o312B24M90L106J950L576J404k83D056b624m98A732O453
11224H185L659L466M80n637C707O04J5n43N43R06R52R46K132J955q80j577J635
11207A0395R67K316J773j134n239G11d593c50G824l16k844I25d407n105l997Q84
11191a2625M299K320b707L30k107J49a468A861J520J278J171K373j161Q69K293
11176A0204K444J049J388k269n055C875j797d29A088L749K924J462j863n90j01
$$ plain form
11161 6669 5343 3858 4626 8804 8924 6447 5647 7264 8171 9370 8856 6707 2625 -2477 -5211 -8448
11145 -8448 -9880 -7250 -5935 -4244 -3873 -2559 420 1243 670 -53 -2192 -5596 -6166 -1544 1839 2914
11129 2914 3074 5007 3521 -37 -121 5193 5670 2014 -4437 -7723 -5292 -417 1788 1184 -1027 -98 838
11111 1050 -2248 -6415 -10194 -12522 -9825 -4162 -2985 -5606 -6316 -5648 -4103 -2027 1422 9422 12460
11096 12460 8856 5240 3063 -570 -4869 -12008 -14826 -6969 3008 6155 2457 113 -877 -528 3479
11080 7275 12835 11980 8812 9059 7857 5152 3925 9084 14211 16217 16375 16836 17017 16687 16917 18400
11064 18400 21596 22580 20505 18183 16111 12428 10070 10196 14801 19002 15596 7923 4293 4243 -1333
11048 -6486 -1588 5767 6805 6402 4866 4978 7180 6050 6594 6129 4414 882 525 2054 2810 4449
$$ packed form
11161F669j326j485P68M178J20k477q00J617R07J199n14k149B625b477k734l237
11145h448j432K630J315J691L71J314D20Q23n73e3k139l404n70a544A839J075
11129B914J60J933j486c7q4E193M77B014d437l286K431d17A788o04a027i8H38
11111A050b248m167l779k328K697d162J177k621p10O68J545b027A422Q000L038
11096A2460l604l616k177e70m299p139k818f969C008L147B457A13h77L49C479
11080G275N560q55l168K47j202k705j227N159N127K006J58M61J81l30K30J483
11064A8400L196R84k075k322k072l683k358J26M605M201l406p673l630n0a333
11048f486a588E767J038m03j536J12K202j130N44m65j715H82l57J529P56J639
$$ plain form
11032 4449 6703 7596 4684 578 -4443 -4770 -1070 -1096 -2052 374 2698 1967 863 1239 2845 2721 -615 -1398
11014 -1398 2114 4394 4037 1607 -2865 -3318 -315 1276 1691 3144 3955 3346 5284 9753 9290 5405
10998 5405 3645 6429 4914 4238 5132 3547 4465 7077 7489 7821 7123 4382 -1749 -2780 573 1495 2923
10981 2923 2639 1628 0 2772 5902 7772 10391 11919 11463 10060 7702 7094 4765 -269 -5064 -6275
10965 -6275 -5471 -5795 500 6270 4709 7738 11053 9926 9011 8068 10593 12202 8847 10011 10961 10107
10949 10107 6109 83 -812 195 3815 5611 1759 -836 -1685 616 2714 7217 12949 15717 15250 15228 15518
10932 15518 13700 14752 16800 12370 6458 5373 2916 -168 1160 2913 4144 -780 -2071 2154 4599
10917 4599 6241 8249 7304 4607 1361 974 4058 6948 8402 12639 9958 6355 8791 13767 18656
$$ packed form
11032D449K254Q93k912E78d443l27a070k6r56C74K324p31H63L76J606j24f15p83
11014a398B114K280l57A607b865m53c15A276M15J453Q11o09J938M469m63l885
10998E405j760K784j515o76Q94j585R18K612M12L32o98k741a749j031E73R22J428
10981B923k84j011@B772L130J870K619J528m56j403k358o08k329b69m795j211
10965f275Q04l24E00N770j561L029L315j127r15r43K525J609l355J164R50q54
10949A0107l998H3h12A95L620J796A759h36q49F16K098M503N732K768m67k2K90
10932A5518j818J052K048m430n912j085k457a68A160J753J231g80j291B154K445
10917D599J642K008r45k697A361l87L084K890J454M237k681l603K436M976M889
$$ plain form
10902 18656 16064 11503 12305 13705 13526 10898 8211 8316 9464 12835 9477 2896 4391 7750 8311
10887 8311 7556 6598 2895 -957 -1832 -3333 -5599 -6898 -7270 -6541 -5707 -4626 -926 4438 6913 7201 6474
10870 6474 2815 1519 3839 7373 7796 3469 2651 3237 4048 4983 8278 10095 8757 7290 10324 16390
10854 16390 13840 7642 8830 15031 17734 14028 8603 5646 2436 -1623 -5895 -3043 2475 4583
10840 4583 6018 7684 6645 2943 750 1697 1911 1131 -372 2220 10679 13741 12406 14080 12581 7734
10824 7734 6391 5663 8464 12045 8504 5007 7922 9662 9392 8023 6287 5951 3622 1811 -1150
10808 -3891 -1384 189 2364 6019 8221 7893 9034 10024 3249 -3698 -6041 -5305 -3489 -1361 986 4462
10792 4462 7800 9793 10678 11293 10251 12231 15169 11453 4412 2508 35 -6671 -10092 -7837 -5452 -4022
$$ packed form
10902A8656k592m561Q02J400j79k628k687J05J148L371l358B896J495L359N61
10887H311p55r58B895i57q75j501k266j299l72P29Q34J081i26D438K475K88p27
10870F474B815j296K320L534M23C469q18N86Q11R35L295J817j338j467L034O066
10854A6390k550o198J188O201K703l706n425k957B436a623m272K852B475K108
10840D583J435J666j039B943G50R47K14p80c72B220Q459L062j335J674j499m847
10824G734j343p28K801L581l541l497K915J740k70j369j736l36k329A811a150
10808c891a384A89K175L655K202l28J141R90C249c698k343P36J816a361I86L476
10792D462L338J993Q85O15j042J980K938l716D412j904C5f671l421K255K385J430
$$ plain form
10776 -4022 -1886 4878 9309 10671 10985 6490 4042 5224 4807 1691 -102 231 -1118 -8164 -9931 -5487
10760 -5487 -262 431 -3007 -5944 -6098 -4029 2760 6291 6439 9422 13433 16191 15216 10058 6808 8197
10744 8197 8604 8265 6506 5522 8504 10706 9885 7203 6342 8157 8414 5833 2064 -797 -1895 -936 2242
10726 6685 6242 3211 4932 7024 7023 7946 11094 10654 10829 12744 12553 13037 11296 5201 3430 5224 1659
10708 -2341 -551 4247 4225 4113 3347 2966 2721 159 -508 -2061 -1672 412 1512 -1637 -5170 -2103 1171
10690 515 -4738 -9747 -7217 -4715 -3662 -990 -271 2573 4537 2906 -1224 -3066 -3538 -1490 1057 1489
10674 1489 -2973 -10087 -10175 -7383 -4718 -416 4605 6237 7532 11909 12168 6696 -52 -2777 -1002 -179
10657 1164 6243 10876 12508 13089 12827 11720 12138 12647 10985 10880 13758 18085 16737 11715 6608 447
$$ packed form
10776d022a886D878M431J362L14m495k448J182m17A691a02B31a118p046j767M444
10760e487b62D31c007k937j54K069B760L531J48K983M011K758r75n158l250J389
10744H197M07l39j759r84K982K202q21k682q61J815K57k581B064g97j098i36B242
10726F685m43l031J721K092jR23L148m40J75J915j91M84j741E201j771J794A659
10708b341e51D247k2j12p66l81k45A59e08j553L89D12J100a637l533b103A171
10690E15d738n009K530K502J053i90b71B573J964j631a224j842m72a490A057M32
10674A489b973p114q8K792K665d16D605J632J295M377K59n472e2k725a002a79
10657A164N079M633J632N81k62j107M18N09j662j05K878M327j348n022n107D47
$$ plain form
10640 -1479 -357 3607 10687 12038 10519 9554 10949 14168 11258 5444 6186 10318 11799 9250 6609
10625 6609 7747 6579 5522 4890 7267 9550 8995 9391 10472 10054 9152 12125 17324 19301 18554 16842
10609 16842 17307 13049 6898 4185 5698 8916 11342 11558 14318 16408 14368 8404 5397 6491 10862
10594 10862 18780 25084 22888 16710 12738 13877 19331 18180 18034 20250 22558 31059 37093 35523 35471
10579 35471 36922 39698 46077 53449 58504 65423 75949 88081 110234 151770 219469 329852 498992
10566 498992 643920 623461 462801 306289 210875 164693 142833 129088 115624 108708 113408
10555 113408 124454 148065 186081 247347 365797 544396 684217 641461 457249 287319
10545 287319 184742 128821 96852 74033 58580 52875 48538 44320 40284 35894 32773 28102 26590
$$ packed form
10640a479c57C607P080J351j519r65J395L219k910E444P42M132J481k549k641
10625F609J138j168j057o32K377K283n55L96J081m18r02K973N199J977p47j712
10609A6842M65m258o151k713J513L218K426K16K760K090k040n964l007J094M371
10594A0862P918O304k196o178l972J139N454j151j46K216K308Q501O034j570n2
10579C5471J451K776O379P372N055O919J0526J2132K2153M1536O7699J10383J69140
10566D98992J44928k0459j60660j56512r5414m6182k1860j3745j3464o916M700
10555A13408J1046K3611L8016O1266J18450J78599J39821m2756j84212j69930
10545B87319j02577n5921l1969k2819j5453n705m337m218m036m390l121m671j512
$$ plain form
10532 26590 25955 23343 22178 24939 23588 19650 15931 16251 15068 12848 10886 9853 8448 12037 19079
10517 19079 25797 28525 23397 15205 9127 7750 7545 3211 -1181 -499 3436 6431 6120 6621 5004
10502 5004 2034 -884 2673 7923 8765 4839 714 565 5997 8396 7147 5299 7444 11240 11296 12037
10486 12037 10828 5461 4160 5927 2586 -2409 -3731 -481 2589 7113 9834 9945 8954 4225 -2177
10470 -3828 -2324 -1319 2663 6649 8030 7027 3705 976 60 4353 8239 9735 7762 2907 259 3935
10454 3935 9878 9251 8644 10391 7927 1862 -972 -437 3433 5530 6372 9579 16621 18803 17627 15505
10438 15505 14150 9553 2306 -3751 -2830 2533 2646 151 -1142 -4246 -7822 -7293 -4092 -481 -656 -3544
10422 -3544 -2433 4716 14154 17410 16899 10200 6478 7386 8590 7109 9287 13255 12382 11934 12649 8577
$$ packed form
10532B6590o35k612j165K761j351l938l719L20j183k220j962j033j405L589P042
10517A9079O718K728n128q192o078j377k05C211a181d99C436K995l11N01j617
10502E004B034h84B673N250Q42l926G14j49N432K399j249j848K145L796N6P41
10486A2037j209n367j301J767B586b409j322d81B589M524K721J11r91D225b177
10470c828J504J005B663L986J381j003l322I76F0M293L886J496j973B907B59L676
10454C935N943o27o07J747k464A862i72d37C433K097Q42L207P042K182j176k122
10438A5505j355m597B306c751R21B533J13A51a142l104l576N29L201d81j75k888
10422c544J111D716R438L256n11o699l722R08J204j481K178L968q73m48P15m072
$$ plain form
10406 8577 5688 7717 10811 8618 7493 8172 5791 1868 3845 6326 2847 -958 -667 2937 5841
10391 5841 5595 3518 5294 7964 6133 136 -3126 -3088 -1427 157 971 2389 1238 -55 1380 2473 1836
10374 1836 709 -2072 -5357 -3336 914 4035 10974 16412 16627 16374 13086 7577 4522 -408 -1566 149
10357 1241 4322 5845 9401 13426 16748 15702 12815 8316 4721 3700 2505 758 -2088 218 3918
10342 3918 6288 6970 9118 9892 5470 3650 7791 6615 4466 5589 4912 4223 7051 10571 11438 9387
10326 9387 8343 6402 7558 9699 10971 8803 6241 8372 12794 15513 12261 8804 9019 12203 16156
10311 16156 17917 16348 15847 11218 5562 3773 4688 8544 12565 15708 16123 14139 8772 3908 385
10295 -148 1300 1998 2136 4825 10565 13057 8903 2194 -718 2133 8179 11654 13050 13250 12998 11603
$$ packed form
10406H577k889K029L094k193j125O79k381A868J977K481B847i58K91B937K904
10391E841k46k077J776K670j831A36c126L8a427A57Q14J418j151e5A380J093o37
10374A836G09b072l285K021I14L121O939N438K15k53l288n509l055d08j158A49
10357A241L081J523L556M025L322j046k887m499l595j021j195G58b088B18L700
10342C918K370O82K148P74m422j820M141j176k149J123o77o89K828L520Q67k051
10326I387j044j941J156K141J272k168k562K131M422K719l252l457K15L184L953
10311A6156J761j569n01m629E562j789R15L856M021L143M15j984n367C908C85
10295a48A300O98J38K689N740K492m154B194g18B133O046L475J396K00k52j395
$$ plain form
10279 11603 9529 10568 15763 21751 24508 19579 16115 18161 19243 19344 23195 23539 20052 18023 16152
10264 16152 11576 8306 8788 13394 16367 15187 9352 3926 1758 961 -111 -2382 -5475 -7933 -7658
10249 -7658 -1771 4973 7722 6972 7851 13070 14471 11353 8536 7090 4629 3518 2106 104 -1865
10233 -6032 -8234 -6407 -829 1436 861 845 2315 4917 7984 8484 6897 4870 3209 4236 7054 6076
10217 6076 3099 10755 23011 29860 25906 16648 8827 7783 9260 11972 16703 18289 15481 10264
10203 10264 6764 4676 3830 7410 9914 10208 4664 -1690 -3040 -674 2742 7325 5784 541 -1117
10187 -1499 -2457 3 6378 8520 2630 -1957 15 1888 2721 -1063 -4821 -5234 -3447 -1019 1549 3642 4812
10170 4812 519 -4944 -3059 1208 5688 8519 8800 11972 18729 19036 17067 13921 12218 14348 16860
$$ packed form
10279A1603k074J039N195N988K757m929l464K046J082J01L851L44l487k029j871
10264A6152m576l270M82M606K973j180n835C926A758p97a11k271l093k458K75
10249g658a771D973K749p50Q79N219J401l118k817j446k461j111j412A04a865
10233f032k202J827h29A436n75j6J470K602L067N00j587k027j661J027K818r78
10217F076k977P656J2256O849l954r258p821j044J477K712M731J586k808n217
10203A0264l500k088q46L580K504K94D664a690j350f74B742M583j541E41a117
10187a499r58CO375K142B630a957A5J873Q33a063l758m13J787a019A549K093J170
10170D812E19d944J885A208M480K831K81L172O757L07j969l146j703K130K512
$$ plain form
10155 16860 20400 24185 17428 8078 3760 1092 -1245 -1400 2606 7452 10478 15158 22648 27610 29031
10140 29031 25597 17884 11724 7008 2022 -1317 1598 6671 9135 8099 7086 6908 8272 10172 8795
10125 8795 9174 7648 6240 4565 5206 7885 4750 5027 7521 8955 8377 6667 5016 2511 3222 4804
10109 4804 6689 7041 5739 3853 5829 10665 10077 7396 3528 1082 -516 2081 8198 10973 11559 11453
10093 11453 13882 16550 12697 12408 14443 12206 11531 15611 14305 11288 11731 14695 17113 17257 19954
10078 19954 24991 27853 25952 32246 46632 63646 83353 96669 107565 109370 102652 91173 81138
10065 81138 74921 65804 55423 47575 45097 43123 34442 25009 22441 19680 15977 19320 21970 18791
10051 18791 14476 16054 17730 14656 15528 14601 10905 9882 14263 21180 32191 48932 57963 51019
$$ packed form
10155A6860L540L785o757H078C760A092a245j55B606M846L026M680P490M962J421
10140B9031l434p713o160m716B022a317A598N073K464j036j013j78J364J900j377
10125H795L79j526j408j675O41K679l135K77K494J434n78j710j651k505P11J582
10109D804J885L52j302j886J976M836n88k681C528A082e16B081O117K775N86j06
10093A1453K429K668l853k89K035k237o75M080j306l017M43K964K418J44K697
10078A9954N037K862j901O294J4386J7014J9707J3316J0896J805o718j1479j0035
10065H1138o217r117j0381p848k478j974q681r433k568k761l703L343K650l179
10051A8791m315J578J676l074Q72r27l696j023M381O917J1011J6741R031o944
$$ plain form
10037 51019 42201 33855 26546 26850 30466 31860 31246 27521 27493 29409 27522 23214 19528 18206 16559
10022 16559 13611 11484 10036 6233 6809 10581 16388 20683 21318 19296 21614 26174 26791 31413 36809
10007 36809 37962 39043 41945 39343 36846 36892 39543 38512 32603 25546 21433 19577 21497 19789 19774
9992 19774 27794 35280 40415 45927 49168 53907 64124 75092 88039 106858 126784 152506 197898
9979 197898 254028 310592 374464 426857 445539 441459 422506 375573 311015 253248 195873 147415
9967 147415 112894 93410 82080 73317 67883 66927 70272 74485 75954 85043 112650 167623 240797
9954 240797 310788 385177 447993 475687 479345 463269 413346 341138 270284 197282 138212 100160
9942 100160 77457 62412 51199 46683 45434 40244 36708 34258 32129 28356 24257 19332 12588 12368
$$ packed form
10037E1019q818q346p309L04L616J394o14l725k8J916j887m308l686j322j647
10022A6559k948k127j448l803N76L772N807M295O35k022K318M560O17M622N396
10007C6809J153J081K902k602k497M6K651j031n909p057m113j856J920j708j5
9992A9774Q020P486N135N512L241M739J0217J0968J2947J8819J9926K5722M5392
9979A97898N6130N6564O3872N2393J8682m080j8953m6933o4558n7767n7375m8458
9967A47415l4521j9484j1330q763n434r56L345M213J469R089K7607N4973P3174
9954B40797O9991P4389O2816K7694L658j6076m9923p2208p0854p3002n9070l8052
9942A00160k2703j5045j1213m516j249n190l536k450k129l773m099m925o744k20
$$ plain form
9928 12368 17972 15901 11931 11769 12368 11756 8120 7031 5284 2513 1038 483 2523 6275 4612 4193
9912 4193 6619 7780 9452 13821 11579 9408 11212 11887 12662 14967 18270 19842 19138 13714 11334 11112
9896 11112 11662 11892 12813 14518 17205 21509 21085 20979 22782 20310 17795 18148 18657 20350 23093 24337
9880 24337 21234 16264 14060 14431 18353 23072 24614 22051 17306 12208 8534 6003 6529 8861 8993
9865 8993 9529 12693 17857 21761 21577 22061 26361 31603 31410 25513 19699 18827 24054 31529 32872 31645
9849 31645 30509 25549 19984 16155 10255 8064 11623 16016 19018 19612 21080 29054 34173 35614 40486
9834 40486 52534 63167 64020 55414 44186 37261 37113 34660 34701 38012 36874 31261 26671 24707 24731
9819 24731 27424 29190 31027 33185 34272 33588 28335 27252 36729 48728 61419 79143 107056 146020
$$ packed form
9928A2368N604k071l970j62N99o12l636j089j747B513A038D83K040L752j663m19
9912D193K426J161J672M369k242k171J804O75P75K305L303J572p04n424k380k22
9896A1112N50K30R21J705K687M304m24j06J803k472k515L53N09J693K743J244
9880B4337l103m970k204L71L922M719J542k563m745n098l674k531N26K332J32
9865H993N36L164N164L904j84M84M300N242j93n897n814q72N227P475J343j227
9849C1645j136m960n565l829n900k191L559M393L002N94J468P974N119J441M872
9834D0486J2048J0633Q53q606j1228o925j48k453M1L311j138n613m590j964K4
9819B4731K693J766J837K158J087o84n253j083R477J1999J2691J7724K7913L8964
$$ plain form
9805 146020 194346 243343 294626 343655 371334 375727 363607 331356 284998 235953 185864 141424
9793 141424 110569 94195 89019 85131 79220 79616 84286 89259 98336 118101 147885 192017 254805
9780 254805 324696 402130 476994 520647 525674 511563 463746 387657 306774 228048 162488 119027
9768 119027 99501 89881 81266 74996 67353 58641 51021 41222 34938 32700 34420 34126 28343 24966
9754 24966 21892 18408 18984 23254 26019 27606 28544 25546 24022 21350 20561 23308 30066 35628 36445 31278
9738 31278 25676 25746 26131 26397 30035 33824 36603 39714 44080 42978 43141 47096 49546 48313 40631 33367
9722 33367 29259 24855 21070 21244 24101 29264 33520 34385 34366 33867 32718 35105 36793 38860 43956 49403
9706 49403 50688 49088 45847 48971 54489 55070 54088 49652 43768 42675 41557 36970 32981 31484 31292
$$ packed form
9805A46020M8326M8997N1283M9029K7679M393j2120l2251m6358m9045n0089m4440
9793A41424l0855j6374n176l888n911L96M670M973R077J9765K9784M4132O2788
9780B54805O9891P7434P4864M3653N027j4111m7817p6089q0883p8726o5560m3461
9768A19027j9526r620q615o270p643q712p620r799o284k238J720k94n783l377
9754B4966l074l484N76M270K765J587R38k998j524k672p89K747O758N562Q17n167
9738C1278n602P0L85K66L638L789K779L111M366j102J63L955K450j233p682p264
9722C3367m108m404l785J74K857N163M256Q65j9m99j149K387J688K067N096N447
9706D9403J285j600l241L124N518N81r82m436n884j093j118m587l989j497j92
$$ plain form
9691 31292 30104 26978 28112 31948 34297 31668 33713 35265 32806 30906 32029 34058 38848 48820 57062
9676 57062 59985 63482 69774 80984 100489 140080 206397 269232 271898 263304 310659 353006 290868
9663 290868 197586 143027 120531 112876 113162 118011 131433 156676 173395 164325 160653 184056 245157
9650 245157 344372 453138 481326 448129 471913 516889 451842 343266 297695 292444 268931
9639 268931 249125 224287 173686 135300 113823 100232 94422 93285 95195 104583 119936 139668
9627 139668 173606 234030 300333 306691 274508 277994 296472 261043 194337 147129 120122 107340
9615 107340 106395 113566 131136 155867 185984 233017 312084 404372 474718 534348 572405 545885
9603 545885 475076 402270 318730 237211 184357 155503 143007 140723 147388 167420 211054 286088
$$ packed form
9691C1292j188l126J134L836K349k629K045J552k459j900J123K029M790R972Q242
9676E7062K923L497O292J1210J9505L9591O6317O2835K666q594M7355M2347o2138
9663B90868r3282n4559k2496p655K86M849J3422K5243J6719r070l672K3403O1101
9650B45157R9215J08766K8188l3197K3784M4976o5047j08576m5571n251k3513
9639B68931j9806k4838n0601l8386k1477j3591n810j137J910R388J5353J9732
9627A39668L3938O0424O6303O358l2183L486J8478l5429o6706m7208k7007j2782
9615A07340r45P171J7570K4731L0117M7033P9067R2288P0346N9630L8057k6520
9603E45885p0809p2806q3540q1519n2854k8854j2496k284O665K0032M3634P5034
$$ plain form
9591 286088 374643 446547 510218 551785 527124 458211 383500 296822 214605 158990 126022 106644
9579 106644 95507 84852 82432 81895 74898 64017 58277 58113 61298 67458 76968 91302 107082 131892
9565 131892 184807 269892 340344 345371 329699 341387 329460 255954 178024 132048 108579 99932
9553 99932 94758 88765 86904 88186 90801 100026 111447 130218 168702 226421 286898 318274 348638
9540 348638 422959 480429 439710 371400 346101 313071 238336 164668 114347 86029 74335 66559
9528 66559 60233 54730 53689 52389 53002 65517 88432 119003 162326 204851 210020 196753 205448
9515 205448 202417 161671 114268 81779 62953 53727 48138 44483 39973 32003 25134 22375 21387 21297
9501 21297 21890 25145 27479 31176 34287 33384 30336 31158 34563 34476 30256 24837 22834 20159 19269 21356
$$ packed form
9591B86088Q8555P1904O3671M1567k4661o8913p4711q6678q2217n5615l2968j9378
9579A06644j1137j0655k420n37o997j0881n740j64L185O160R510J4334J5780K4810
9565A31892N2915Q5085P0452N027j5672J1688j1927p3506p7930m5976k3469q647
9553I9932n174n993j861J282K615R225J1421J8771L8484N7719O0477L1376L0364
9540C48638P4321N7470m0719o8310k5299l3030p4735p3668n0321k8318j1694p776
9528F6559o326n503j041j300O13J2515K2915L0571M3323M2525N169j3267Q695
9515B05448l031m0746m7403l2489j8826r226n589l655m510p970o869k759r88r0
9501B1297N93L255K334L697L111r03l048Q22L405q7m220n419k003k675q90K087
$$ plain form
9485 21356 22883 24684 26072 25065 23760 26086 26038 23249 21651 19293 18457 20892 24408 25767 29532
9470 29532 36123 41192 42534 42972 46781 48424 44360 41624 44489 49311 56856 69895 84553 99669
9456 99669 116608 141811 136403 101989 79470 68440 62823 59481 63542 81882 112355 133353 123216
9443 123216 97021 81860 78322 87292 111329 143566 141587 117650 100751 92556 89873 94105 101581
9430 101581 111534 131595 147397 129786 112331 115045 131758 174209 264014 419911 535949 418957
9418 418957 256969 167640 123618 100177 86287 72943 63291 59049 54330 47724 45438 48208 46694
9405 46694 40984 37182 33763 32130 38030 46097 50455 53669 54111 47112 38760 30763 27366 30918 33585
9390 33585 33470 32415 27669 22297 22327 26672 30871 31453 29742 32973 43655 48969 47290 47122 50978 54331
$$ packed form
9485B1356J527J801J388j007j305K326m8k789j598k358q36K435L516J359L765
9470B9532O591N069J342M38L809J643m064k736K865M822P545J3039J4658J5116
9456I9669J6939K5203n408l4414k2519j1030n617l342M061J8340L0473K0998j0137
9443A23216k6195j5161l538Q970K4037L2237j979k3937j6899q195k683M232P476
9430A01581R953K0061J5802j7611j7455K714J6713M2451Q9805J55897J16038j16992
9418D18957j61988q9329m4022k3441j3890j3344r652m242m719o606k286K770j514
9405D6694n710l802l419j633N900Q067M358L214M42o999q352p997l397L552K667
9390C3585j15j055m746n372L0M345M199N82j711L231J0682N314j679j68L856L353
$$ plain form
9374 54331 52451 49670 42268 31959 28543 27324 23537 20471 20896 24149 28683 28757 29632 28443 25770
9359 25770 23314 24148 22361 26843 37720 41642 42238 45098 46512 46910 49572 48333 45282 42557 35828
9344 35828 30268 29834 31281 33408 34675 33760 33876 36665 40016 36316 29340 26657 28782 32107 33947
9329 33947 31605 32142 37882 39301 36967 34742 32082 30791 28280 23862 22767 26894 32199 37270 39786
9314 39786 39359 35464 35028 40280 41643 40509 33216 23508 20717 23439 27053 28560 26701 24557 28906
9299 28906 35511 38621 35800 33067 32324 33315 34471 36508 41518 43095 42457 40408 40338 41166 39088 36278
9283 36278 34161 37799 43498 41881 34944 27837 25520 27004 30332 35721 40224 38508 33708 32700 37379
9268 37379 46281 54562 55702 53547 49842 45350 41224 37523 38350 38572 38533 40777 45533 49517 47160 47370
$$ packed form
9374E4331j880k781p402j0309l416j219l787l066M25L253M534P4Q75j189k673
9359B5770k456Q34j787M482J0877L922N96K860J414L98K662j239l051k725o729
9344C5828n560m34J447K127J267r15J16K789L351l700o976k683K125L325J840
9329C3947k342N37N740J419k334k225k660j291k511m418j095M127N305N071K516
9314C9786m27l895m36N252J363j134p293r708k791K722L614J507j859k144M349
9299B8906O605L110k821k733p43R91J156K037N010J577o38k049p0Q28k078k810
9283C6278k117L638N699j617o937p107k317J484L328N389M503j716m800j008M679
9268C7379Q902Q281J140k155l705m492m126l701Q27K22l9K244M756L984k357K10
$$ plain form
9252 47370 54159 59134 59246 57359 53809 50671 49902 52618 57858 60266 58251 57460 60728 65777 71608
9237 71608 76794 81659 86451 90446 89165 83134 77346 73567 75088 79034 79374 73515 69436 72141 78537
9222 78537 81504 84494 84046 75449 67226 67282 70991 72739 74915 79108 82292 83647 83553 88275 93638 95712
9206 95712 94775 91068 87396 87339 89020 88599 90929 98662 107790 109552 111296 113057 110972 111054 116119 121323
9190 121323 125810 128063 128674 131131 132861 133717 133474 138190 145914 154865 159488 157559 155036 164070 180557
9175 180557 191605 189641 189608 191773 197985 205566 211840 222373 238942 258470 271568 275560 272874 269510
9161 269510 272862 281855 295271 310064 326209 341985 358026 383132 413962 442243 474131 524264
9149 524264 601896 720303 890162 1008744 909999 775454 732481 745603 779531 816309 849834
$$ packed form
9252D7370O789M975J12j887l550l138p69K716N240K408k015p91L268N049N831
9237G1608N186M865M792L995j281o031n788l779J521L946L40n859m079K705O396
9222G8537K967K990m48q597q223N6L709J748K176M193L184J355r4M722N363K074
9206I5712r37l707l672n7J681m21K330P733R128J762J744J761k085Q2N065N204
9190A21323M487K253O11K457J730Q56k43M716P724Q951M623j929k523R034J6487
9175A80557J1048j964l3K165O212P581O274J0533J6569J9528J3098L992k686l364
9161B69510L352Q993J3416J4793J6145J5776J6041K5106L0830K8281L1888N0133
9149E24264P7632J18407J69859J18582r8745j34545m2973J3122L3928L6778L3525
$$ plain form
9138 849834 889532 945230 1018010 1108219 1223228 1362351 1524256 1720274 1970339 2283414
9128 2283414 2675739 3157480 3768293 4597437 5767639 7444913 9933942 13879630 20753749
9119 20753749 33760150 57706172 84777848 75866782 44936330 25523112 15848374
9112 15848374 10718672 7751118 5901148 4663996 3773935 3103055 2587914 2196955 1899111
9103 1899111 1659951 1449423 1265145 1120864 1006205 910515 829823 761468 700253 642484
9093 642484 590810 559486 560332 601992 693857 810041 765464 568716 425759 347792 303730
9082 303730 268844 238867 219792 203793 182745 162461 144725 133610 128084 122506 116795 108468
9070 108468 99545 95289 89363 80919 76189 71016 60865 51356 48417 46134 44311 45935 46919 47373 45555
$$ packed form
9138H49834L9698N5698P2780R0209J15009J39123J61905J96018K50065L13075
9128B283414L92325M81741O10813Q29144J170202J677274K489029L945688O874119
9119B0753749J3006401K3946022K7071676q911066l0930452j9413218r674738
9112A5848374n129702k967554j849970j237152q90061o70880n15141l90959k97844
9103A899111k39160k10528j84278j44281j14659r5690q0692o8355o1215n7769
9093F42484n1674l1324Q46M1660R1865J16184m4577j96748j42957p7967m4062
9082C03730l4886k9977j9075j5999k1048k0284j7736j1115n526n578n711q327
9070A08468q923m256n926q444m730n173j0151r509k939k283j823J624R84M54j818
$$ plain form
9055 45555 39912 29996 23708 21620 23442 24654 22266 21454 19037 14034 14479 17319 17964 15305 12460
9040 12460 9193 4185 620 -859 194 3225 2882 1134 1948 -1151 -8575 -16217 -21578 -20670 -18509 -14123
9024 -14123 -9601 -6453 -6533 -7641 -8406 -8479 -5922 -1241 -257 -7018 -13034 -12171 -6773 2123 3128 -115 -5945
9007 -5945 -9185 -5604 -5771 -9435 -11805 -13554 -15694 -22395 -28313 -27432 -21027 -13602 -11115 -12293 -14182
8992 -14182 -15157 -17514 -20886 -19693 -12285 -6722 -8691 -11579 -12627 -15627 -15989 -13509 -10536 -12246 -16290
8977 -16290 -12415 -5969 -2570 -2038 -3136 -2800 420 3102 368 -4123 -4960 -4385 -1987 674 2298 217 -6626
8959 -12799 -13690 -12404 -13196 -12549 -12285 -12681 -14019 -14676 -16634 -16137 -16867 -18956 -19083 -17650 -14607 -11122 -10498
8942 -10498 -10565 -11865 -14678 -16222 -14911 -13615 -12052 -8760 -7394 -9705 -17062 -24255 -24948 -20351 -18315
$$ packed form
9055D5555n643r916o288k088J822J212k388q12k417n003M45K840O45k659k845
9040A2460l267D185F20h59A94L031l43A134Q14a151p424p642n361R08K161M386
9024a4123M522L148q0j108p65p3K557a241b57o761o016Q63N398B123J005a15n830
9007e945l240L581j67l664k370j749k140o701n918Q81O405P425K487j178j889
8992a4182r75k357l372J193P408N563j969k888j048l000l62K480K973j710m044
8977a6290L875e969b570N32j098L36D20K682C68d123q37N75a987F74J624B17f626
8959a2799q91J286p92O47K64l96j338o57j958M97p30k089j27J433L043L485O24
8942a0498o7j300k813j544J311J296J563L292J366k311p357p193o93M597K036
$$ plain form
8927 -18315 -18267 -16566 -14847 -15313 -13860 -9166 -4123 -1817 -6390 -13406 -15367 -14106 -10323 -4480 -2766
8912 -2766 -579 2028 2894 -731 -5430 -6969 -5560 -7889 -4600 4410 7438 4899 -22 -7184 -12135 -10717
8896 -10717 -6383 -3718 -6051 -8067 -6003 -3441 181 1899 -1645 -3996 -3164 -3904 -7484 -8983 -8771 -9817
8880 -9817 -8228 -5466 -5850 -8634 -9764 -10257 -6311 266 2618 -3175 -9236 -12711 -11494 -7136 -1392 88
8863 -4644 -11507 -14361 -14845 -11710 -11487 -10109 -6241 -1476 -762 -7664 -8572 -2949 544 1029 1393 1326 -1740
8845 -4664 -4381 -1357 -2799 -7445 -7872 -5234 -4063 -475 5445 9408 8076 2832 -4348 -8994 -5348 -3900
8829 -3900 -5165 -3456 -2621 -2103 3038 2161 -2228 1576 8854 10846 6925 4736 8721 18113 28267
8814 28267 35915 48457 67875 97529 151976 258622 420020 459388 298409 162009 88920
$$ packed form
8927a8315M8J701J719m66J453M694d123a817m573p016j961J261L783d480J714
8912b766e79B028Q66g31m699j539J409k329L289D410L028k539b2p162m951J418
8896a0717M334K665k333k016K064K562A81J718a645k351Q32p40l580j499K12j046
8880i817J589K762l84k784j130m93L946B66K352c175o061l475J217M358a392H8
8863d644o863k854m84L135K23J378L868a476P14o902r08b949E44M85L64o7a740
8845d664K83a357j442m646m27K638J171d75E445L963j332B832d348m646L646J448
8829c900j265J709Q35N18C038q77b228A576P278J992l921k189L985R392J0154
8814B8267P648J2542J9418K9654N4447J06646J61398L9368j60979j36400p3089
$$ plain form
8803 88920 54196 36697 27529 21332 17480 14764 13146 13414 11965 11233 13601 15304 16788 20236 23774
8788 23774 25151 21013 11560 3587 4673 4926 2109 1287 4052 3489 2491 -55 -4022 -5464 -6022 -6310 -719
8770 5572 6290 787 -5439 -3907 935 1543 -3723 -10679 -10831 -9685 -7579 126 6190 2800 -2208 -6439
8754 -6439 -10910 -13592 -14591 -13111 -13312 -14744 -14180 -11365 -11420 -13240 -12159 -6284 -2005 -1617 -3856 -6641
8738 -6641 -5247 -2172 316 1144 -3787 -10948 -12018 -14264 -17817 -18305 -14088 -9547 -8921 -5677 -2966 -2196
8722 -2196 -3390 -7061 -8407 -8879 -9356 -9395 -12037 -13691 -16568 -18734 -16713 -12870 -9930 -9353 -10606 -8346
8706 -8346 -1845 476 -694 -1562 -1565 1077 2321 2407 404 -3090 -4293 -4191 -5199 -7230 -5425 -2914 -2313 -1835
8688 -1835 3534 4907 -446 -7082 -9201 -10340 -12607 -14907 -12583 -8056 -8385 -7231 -4064 -1998 -2597 -297
$$ packed form
8803H8920l4724j7499r168o197l852k716j618K68j449p32K368J703J484L448L538
8788B3774J377m138r453C587J086K53B109q22K765n63r98e5l967j442n58k88g19
8770E572P18G87e439J532I35O08c723o956j52J146K106A26O064B800b208m231
8754f439m471k682r99J480k01j432N64K815n5j820J081N875b005L88k239k785
8738f641J394b172C16Q28c787p161j070k246l553m88M217M541O26L244K711P70
8722b196j194l671j346m72m77l9k642j654k877k166K021L843K940N77j253K260
8706h346a845D76f94q68lA077J244Q6D04c090j203J02j008k031J805K511O01M78
8688a835C534J373d46o636k119j139k267k300K324M527l29J154L167a998n99b97
$$ plain form
8671 -1208 -2361 -4229 375 6843 9112 8517 6110 3724 4801 5016 1420 151 234 -2200 -3177 -3430 -3173
8654 -3173 -4178 -2919 1086 2891 -852 -3443 292 4002 3205 2914 4314 5938 5272 1544 -3091 -5043
8638 -5043 -4745 -5415 -5190 -694 2768 806 1028 5553 7601 7221 4366 -1191 -8510 -12483 -12769 -13405 -12973
8621 -12973 -8303 -5939 -1554 2565 750 -2918 -1050 4257 2556 -525 564 4578 4393 437 -4079 -4302
8605 -4302 -2672 -841 1678 4713 3716 1826 377 -2581 -8404 -14381 -16391 -17352 -16072 -10606 -2859 2582
8588 8830 10058 6088 2785 6701 10157 14230 16009 11181 6515 3172 2818 7962 10074 2567 -1406
8572 -2621 -1246 988 1524 4375 2314 -5908 -10409 -9069 -7446 -7331 -6520 -2749 -2210 -1527 -587 -4236 -3697
8555 -3697 -135 232 588 -928 -4731 -6153 -3688 -2912 -2337 -1617 2164 5000 4638 4398 5230 3320 263 -121
$$ packed form
8671a208j153j868C75O468K269n95k407k386J077K15A420A51Q3b200r77k53K57
8654c173j005J259A086J805h52k591B92L710p97k91J400J624o66A544c091j952
8638e043K98o70K25f94B768H06K22M525K048l80k855a191p319l973k86o36M32
8621a2973M670K364a554B565G50b918a050D257j701e25E64M014j85D37d079k23
8605d302J630h41A678L035r97A826C77b581n823n977k010r61J280N466b859B582
8588H830J228l970B785L916L456M073J779m828m666C172l54N144K112B567a406
8572b621a246I88N36K851k061e908m501J340J623J15Q11b749N39O83e87l649N39
8555c697a35B32L56i28l803j422K465P76N75P20B164K836l62k40Q32j910B63a21
$$ plain form
8536 437 2956 5118 3645 -4285 -9600 -9228 -5367 143 2395 2987 2631 -534 -284 1400 869 -3439 -10378
8519 -10378 -12756 -10865 -7415 -3561 1812 5225 9219 10600 10334 8397 5760 6437 7437 4221 3996
8504 3996 5535 6943 9494 5514 849 1266 1672 -74 -1013 75 -357 -4320 -5552 -1757 6372 8957 8686
8487 8686 6676 4541 712 -1472 -2764 -4228 -5748 -7351 -7775 -3781 -1247 -4330 -9400 -10189 -7593 -7053
8471 -7053 -3965 3748 9103 5809 -464 -2681 -2806 -3754 -4244 -6525 -8535 -10929 -11099 -6450 -5309 -9467
8455 -9467 -12156 -8939 -3648 -604 -3779 -7305 -7318 -9810 -12945 -13758 -12188 -10017 -7139 -6059 -6587 -2086
8438 862 1000 -1808 -3702 -4359 -1332 646 495 864 -2201 -7834 -13579 -17050 -17058 -14230 -10385 -10692 -10052 -7918
8420 -7918 -7255 -8767 -11221 -9947 -8706 -10599 -11630 -12095 -11201 -13298 -16903 -20489 -20033 -14618 -11604 -11229
$$ packed form
8536D37K519K162j473d285n315L72L861A43K252N92l56e34K50A400n31c439o939
8519a0378k378J891L450c561A812L413L994J381k66j937k637O77J000l216k25
8504C996J539J408K551l980H49M17M06g4r39G5c57l963j232a757F372K585k71
8487H686k010k135G12a472j292j464j520j603m24c781a247l083n070p89K596N40
8471g053L088C748N355l294d64k217j25r48m90k281k010k394j70M649J141m158
8455i467k689L217c648f04l175l526j3k492l135q13J570K171K878J080n28b086
8438H62J38a808j894o57a332F46j51L69b201n633n745l471qK828L845l07O40K134
8420g918O63j512k454J274J241j893j031m65Q94k097l605l586M56N415L014L75
$$ plain form
8404 -11229 -11778 -10878 -8542 -9556 -10460 -6231 -1226 5194 9094 8424 7383 6348 7932 10430 10170 3362
8387 -4442 -5599 1169 6808 4661 1977 -17 -2381 -4194 -6541 -8881 -9433 -8266 -11301 -9762 -1056 4831
8370 5713 4595 7696 8530 1609 -4562 -5893 -4699 -4460 -4736 -6483 -6531 -560 997 -3716 -9049 -10930 -10518
8353 -10518 -10561 -9701 -6131 -1654 479 -1431 -4184 -3809 361 5426 5938 1849 -2548 -4682 -3299 -7178
8337 -7178 -13197 -16561 -16311 -14765 -12678 -14398 -17665 -15718 -15572 -17438 -15579 -10466 -8874 -11930 -14179
8322 -14179 -13604 -9689 -5080 -1209 -4529 -8855 -9238 -8493 -6075 -7162 -7417 -3153 -4273 -10097 -12713 -9669
8306 -9669 -3031 768 -1982 -377 3299 4486 6073 9121 10543 5836 -1677 -3115 -1506 -495 2108 4572
8290 4572 6762 7794 5787 -11 -2033 -707 4425 8652 8001 6865 3870 -174 2803 9512 11342 11355 8838
$$ packed form
8404a1229n49R00K336j014r04M229a226E194L900o70j041j035J584K498k60C362
8387d442j157A169N639k147A977a7k364j813k347k340n52J167l035J539a056D831
8370E713j118L101Q34A609d562j331J194K39k76j747m8e60I97c716n333j881M12
8353a0518m3Q60L570a654D79a431k753L75C61N065N12A849b548k134J383l879
8337g178o019l364K50J546K087j720l267J947J46j866J859N113J592l056k249
8322a4179N75L915M609a209l320m326l83P45K418j087k55c153j120n824k616L044
8306i669c031G68a982c77C299J187J587L048J422m707a677j438a506d95B108K464
8290D572K190J032k007a1k022g07D425M227o51j136k995a74B803O709J830J3k517
$$ plain form
8273 8838 4971 944 -201 -578 227 2152 4682 2914 2311 275 -5367 -7357 -5009 -1054 1955 2743 -488
8255 -122 1508 3483 6299 9376 8553 4359 -79 -3688 -4429 -3383 -2722 -2005 884 5453 9439 13490 17042
8238 17042 18332 12893 4247 1190 2393 2954 2394 -1196 -1894 -22 -2553 -7243 -6464 -3238 1463 3973
8222 3973 3595 4363 5616 7553 5174 1425 1824 4386 6044 6591 7037 7236 2306 -3527 -5378 -5159 -3790
8205 -3790 -548 3028 6165 4268 -2390 -3726 -39 8604 11296 10901 5585 -2411 -2985 1545 -493 -3969
8189 -3969 -5002 -7579 -6574 -2320 -572 -4455 -8338 -5529 -1820 442 667 -2964 -7372 -9454 -11698 -10869
8173 -10869 -7907 -8220 -10709 -12108 -10784 -8258 -9981 -13266 -16891 -20590 -22071 -17804 -10891 -9332 -6622
8158 -6622 -3040 -1051 1874 5537 5034 3958 3702 2839 -4260 -6550 -5313 -5086 -4938 -6570 -9632 -10151
$$ packed form
8273H838l867I44b01l77B27J925K530j768o03B75e367j990K348a054A955P88d88
8255a22A508J975K816L077q23m194g9l609p41J046O61P17H84M569L986M051L552
8238A7042J290n439D247A190J203N61n60a196o98b2k531m690P79L226A463K510
8222C973l78P68J253J937k379A425L99K562J658N47M46J99B306c527j851K19J369
8205c790e48C028L137j897b390j336c9H604K692l95n316b411n74A545d93l476
8189c969j033k577J005b320e72l883l883K809a820D42K25b964m408k082k244Q29
8173a0869K962l13k489j399J324K526j723l285l625l699j481M267O913J559K710
8158f622c040a051A874L663n03j076k56q63d260k290J237K27J48j632l062n19
$$ plain form
8142 -10151 -8809 -8500 -9735 -17221 -19677 -12079 -2588 869 -2518 -1541 -198 -707 538 2484 3965 8120
8126 8120 13620 17030 12421 5453 1195 -1384 769 4051 6076 5491 4639 5396 2218 2390 7146 8958
8110 8958 8103 6601 3009 -2547 -2080 5060 8288 9406 6777 5264 5070 5042 1965 -483 -1535 78 -3119
8092 -3628 -421 2492 5506 8017 6730 2241 -1578 -1469 -3082 -9336 -14382 -17750 -21961 -22616 -16555 -7815
8075 -3097 -3008 -5252 -6734 -4624 -2018 -3724 -6907 -8379 -9554 -8760 -2583 -290 -1594 2199 5204 5413
8059 5413 3062 723 428 -4709 -10507 -13099 -12375 -12929 -10709 -2299 2913 1584 2271 3614 6153 7592
8043 7592 6040 150 -4971 -5644 -3971 -4597 -5183 -3679 -5214 -6652 -6687 -7836 -10234 -9416 -4334 -4862 -7925
8026 -7925 -9524 -10839 -13216 -16015 -17445 -16045 -11684 -9990 -11390 -7906 1918 8158 10792 14026 17157
$$ packed form
8142a0151J342L09j235p486k456P598b588H69b518R77a98n09E38J946J481M155
8126H120N500L410m609E453A195a384G69L282K025n85q52P57B218J72M756J812
8110H958q55j502C009b547M67E060L228J118k629j513j94k8A965d83j052G8c119
8092c628d21B492L014K511j287B241a578J09j613o254n046l368m211o55O061g815
8075c097Q9k244j482K110b018j706l183j472j175P94b583b90j304B199L005K09
8059E413k351G23k95d709n798k592P24n54K220b299B913j329O87J343K539J439
8043G592j552A50d971o73J673o26n86J504j535j438l5j149k398Q18d334n28l063
8026g925j599j315k377k799j430J400M361J694j400L484A918O240K634L234L131
$$ plain form
8011 17157 17814 15869 12425 8726 3850 354 -4967 -7797 -6451 -4749 -7534 -10011 -9012 -5651 -5368 -10032
7995 -10032 -14118 -15015 -13500 -11204 -5988 -5282 -7049 -3912 -2694 -7025 -12951 -12709 -9115 -7384 -8991
7980 -8991 -8080 -5023 -7644 -5254 719 3684 7346 11379 9244 5669 1004 -3587 -6607 -5042 -453 3004
7963 2456 -289 -162 2214 1098 -899 -1613 439 1549 -113 -2868 -2872 -2790 -7893 -13725 -12758 -7079 -2022 -3683
7945 -3683 -4272 -4511 -5953 -10955 -12919 -10966 -9885 -9423 -8727 -8920 -6958 697 6288 6538 7708 8525 5861
7928 5861 4428 5548 6455 6413 3006 -2180 -3944 -3414 -2639 -6760 -9458 -9351 -8997 -8802 -8793 -10401 -9964 -7719
7910 -7719 -7391 -6382 -9600 -14001 -12475 -4772 2939 6397 5396 2148 -1840 -3946 -4602 -3648 289 3737
7894 3737 4659 4275 698 -5637 -8937 -6591 -2193 -85 40 607 1429 6014 6761 -1331 -9004 -13884 -14581 -10547
$$ packed form
8011A7157O57j945l444l699C850C54d967k830J346J702k785k477R99L361K83m664
7995a0032m086q97J515K296N216P06j767L137J218m331n926K42L594J731j607
7980h991R11L057k621K390G19K965L662M033k135l575A004c587l020J565d53C004
7963B456b89J27B214A098h99p14D39J110a13k755mQ2n103n832R67N679b022j661
7945c683n89k39j442n002j964J953J081M62O96j93J962F97N591K50J170Q17k664
7928E861j433J120R07m2C006b180j764N30P75m121k698J07L54J95Rj608M37K245
7910g719L28J009l218m401J526d772B939L458j001B148a840k106o56R54B89L448
7894C737R22l84F98e637l300K346b193h5D0N67Q22M585P47a331p673m880o97M034
$$ plain form
7876 -10547 -7714 -9537 -8814 -5993 -6998 -5965 -4617 -7696 -11491 -9726 -6586 -6685 -4419 2182 5726
7861 5726 5093 5738 8588 8270 1002 -1596 -1046 -2095 -3924 -5650 -7581 -7115 -5710 -3524 -296 273 -5129
7843 -9866 -10394 -9022 -4363 -1953 -5031 -11326 -12670 -8097 -2513 183 -711 -2008 -1770 1551 1664 -2614
7826 -4505 -3706 -4513 -5740 -6772 -5310 -9506 -17619 -19492 -15069 -8335 -6902 -7285 -8827 -11117 -11741 -11695
7810 -11695 -11670 -12690 -16973 -18400 -11843 -6198 -5995 -6923 -9281 -9158 -9069 -12296 -14218 -12175 -8715 -3961
7793 -1409 -1366 1500 6296 10444 8741 2420 -2643 -5969 -12803 -15011 -14443 -14187 -12160 -8352 -8614 -9381
7777 -9381 -8736 -8638 -6485 -7817 -9644 -10810 -13000 -15205 -14525 -14356 -14723 -12076 -7845 -9590 -16384 -19770
7761 -19770 -13807 -10101 -11174 -10952 -12477 -15457 -14396 -14220 -11841 -6214 -4231 -3625 -4227 490 5483 2124
$$ packed form
7876a0547K833j823P23K821j005J033J348l079l795J765L140r9K266B182L544
7861E726o33O45K850l18A002a596N50j049j829j726j931M66J405K186b96B73e129
7843i866n28J372d363a953l078o295j344M573b513A83g11j297K38A551J13b614
7826d505P99q07j227j032J462m196q113j873M423O734J433l83j542k290o24M6
7810a1695K5j020m283j427O557N645K03r28k358J23Q9l227j922K043L460c961
7793a409M3A500M796M148j703B420b643l326o834k208N68K56K027L808k62p67
7777i381O45R8K153j332j827j166k190k205O80J69l67K647M231j745o794l386
7761a9770N963L706j073K22j525k980J061J76K379N627J983O06o02D90M993B124
$$ plain form
7744 -4167 -9058 -10234 -12080 -10008 -11466 -12523 -9571 -7187 -6230 -3725 144 875 124 -3177 -4992 -6663
7728 -6663 -8404 -10056 -7526 -4171 -1244 -1593 -1642 196 3014 6545 9540 9292 3439 -3278 -7517 -7711
7712 -7711 -5512 -4813 -4887 -2071 -176 738 -14 -2269 -3272 -4718 -3973 -3484 -4435 -3855 -882 -4315 -6277 -2573
7693 -2994 -5840 -9169 -11067 -9706 -9198 -11464 -9966 -8771 -10550 -7701 -1243 263 -1101 -770 -2058 -3611
7677 -3611 -4598 -4842 -6657 -6069 -3426 -915 1078 2872 -1152 -4968 -2654 1892 -62 -2455 -3114 -2517 -2409
7660 -2409 -732 -219 5301 12293 11995 11434 6446 2179 -463 1166 5663 8803 11022 14120 20303 20094
7644 20094 18913 19882 20970 17830 16074 14221 10511 7111 2561 437 -388 1846 2763 -754 -4135 -6133
7628 -6133 -8324 -7541 -2395 1671 1355 754 3913 5912 5640 1687 -865 654 1095 -789 -1258 -377 2455
$$ packed form
7744d167m891j176j846K072j458j057K952K384R57K505A44P31A24c177j815j671
7728f663j741j652K530L355a244l49m9A96K818L531K995k48C439c278m239j94
7712g711K199O99p4b071a76G38a4k255j003j446P45M89r51N80h82l433j962b573
7693b994k846l329j898J361N08k266J498J195j779K849a243B63a101L31j288j553
7677c611r87k44j815N88K643i15A078J794a152l816K314A892f2k393o59N97J08
7660b409g32b19E301O992k98n61m988B179d63A166M497L140K219L098O183k09
7644B0094j181R69J088l140j756j853l710l400B561D37c88A846R17g54l381j998
7628f133k191P83b395A671l16o01L159J999k72A687h65F54M41g89m69c77B455
$$ plain form
7610 2073 -1208 -1480 2304 598 -6796 -13394 -14157 -9307 -6543 -9083 -9449 -7869 -10067 -12452 -8565 -4682
7594 -4682 -2676 -4469 -10072 -14595 -13179 -12244 -14200 -13776 -13400 -7935 -4132 -3871 -1855 -366 777 -1894
7577 -2458 -3405 -6608 -8522 -6710 -7469 -7856 -6123 -7113 -10565 -12394 -12241 -8303 -8150 -14549 -16039 -12180
7561 -12180 -10296 -11027 -11289 -7254 -1372 -852 -3041 -5124 -7449 -11673 -16652 -20506 -19567 -16636 -15361 -16013
7545 -16013 -16048 -13550 -9589 -5457 -4061 -2735 -3221 -6753 -7547 -4582 -1641 953 -526 -5690 -10950 -13269
7529 -13269 -14148 -15054 -15391 -14506 -12448 -8193 -6526 -8405 -5269 -2629 -1039 -998 2543 5493 6418 6696 8319
7512 8319 10875 9560 6572 2902 73 4991 11221 9284 -1091 -5348 -5242 -2706 393 1426 1714 102
7495 -646 -5434 -11140 -12246 -11383 -8086 -8702 -11504 -14337 -16777 -16667 -17069 -15520 -11710 -11062 -13311 -14375
$$ packed form
7610B073a208k72B304E98f796o598p63M850K764k540l66J580k198k385L887L883
7594d682K006j793n603m523J416R35j956M24L76N465L803K61a855c66G77a894
7577b458r47l203j914J812p59l87J733r90l452j829J53L938J53o399j490L859
7561a2180J884p31k62M035a372N20k189k083k325m224m979l854R39K931J275o52
7545a6013l5K498L961M132J396J326m86l532p94K965a641I53e26n164n260k319
7529a3269q79r06l37Q85K058M255J667j879L136b629a039M1B543K950R25K78J623
7512H319K556j315k988B902G3M918O230j937a091m257J06K536C93J033K88A02
7495f46m788n706j106Q63L297o16k802k833k440J10m02J549L810O48k249j064
$$ plain form
7479 -14375 -12910 -14117 -16458 -17537 -16988 -16363 -14698 -9910 -5213 -2137 -3611 -7093 -10320 -10457 -8153
7464 -8153 -6048 -8938 -13312 -15422 -13677 -8870 -4577 -2508 -5161 -9815 -12666 -11384 -4765 -1968 -2943
7449 -2943 -3577 -5425 -7322 -7307 -6045 -2764 885 2775 1384 -996 -1261 -3290 -4622 -3792 -23 7375 13437
7432 13437 13957 12762 8943 4045 6766 10001 8053 8705 13327 9842 1917 -5006 -6805 -5421 -4147
7417 -4147 -3667 -3500 -2627 -4820 -9450 -11502 -14566 -12923 -7915 -7655 -10320 -7112 -2313 -2964 -4709 -3483
7401 -3483 849 4934 6431 8134 8782 5309 -2044 -5273 -2545 -2941 -4634 -7101 -10287 -11282 -10062 -6724
7385 -6724 -2099 -990 -1872 -2532 -365 3081 494 -969 -1950 -3565 -4615 -6871 -9718 -13230 -15481 -15899 -14630
7368 -14630 -12652 -10521 -6508 -1595 3235 7810 7144 3287 38 -1270 -1514 1480 2726 1783 -1251 -2959
$$ packed form
7479a4375J465j207k341j079N49O25J665M788M697b137j474l482l227j37K304
7464h153K105k890m374k110J745M807M293K069k653m654k851J282d765a968r75
7449b943o34j848j897J5J262b764H85J890A384i96k65k029j332Q30b3G375O062
7432A3437N20j195l819D045K721L235j948O52M622l485A917e006j799J384J274
7417d147M80J67Q73k193m630k052l064J643N008K60k665L208b313o51j745J226
7401c483H49M085J497J703O48l473b044l229b545l96j693k467l186r95J220L338
7385f724b099i90q82o60c65C081D94i69r81j615j050k256k847l512k251m18J269
7368a4630J978K131M013a595C235M575o66C287C8a270k44A480J246r43a251j708
$$ plain form
7352 -2959 -2858 -3746 -2976 -1563 3244 6503 3771 -1113 -5629 -5875 -10369 -15100 -14139 -9661 -6441 -1908
7335 3253 8250 10161 10177 8335 3423 -4418 -9081 -3231 3159 3384 -776 -4221 -3352 -2148 -3164 -3589
7319 -3589 -1439 -224 -287 420 794 -577 -6083 -12447 -15844 -18126 -19158 -16026 -10339 -3620 -4232 -6298 -5642
7302 -5642 -7056 -11927 -12752 -14321 -15538 -14334 -15107 -14919 -14532 -16762 -15770 -10890 -10009 -10772 -9582 -10426 -11787
7285 -11787 -15584 -18613 -15691 -11586 -8432 -7582 -7290 -10056 -15772 -16842 -11115 -3925 -811 -6350 -13120
7270 -13120 -12965 -7295 -943 2081 1652 -3753 -11234 -13165 -8735 -5686 -8251 -8529 -5669 -4691 -2910 -1995
7254 -1995 -5182 -7069 -7888 -5705 -3080 -5520 -8764 -8716 -6702 -4413 -1747 2799 4577 3925 5425 7245
7238 7245 3229 -5942 -12118 -15009 -19190 -20839 -16626 -9734 -2215 3313 5679 3290 649 -5707 -10558
$$ packed form
7352b959J01q88P70J413C244L259k732a113m516k46m494m731R61M478L220a908
7335C253M997J911J6j842C423d418m663c231C159K25g76l445Q69J204j016m25
7319c589a439b24o3D20L74e77n506o364l397k282j032L132N687c620o12k066O56
7302e642j414m871q25j569j217J204p73J88L87k230R92M880Q81p63J190q44j361
7285a1787l797l029K922M105L154Q50K92k766n716j070N727c925h11n539o770
7270a3120J55N670i43B081m29c753p481j931M430L049k565k78K860R78J781R15
7254a995l187j887q19K183K625k440l244M8K014K289a747B799J778o52J500J820
7238G245C229e942o176k891m181j649M213O892b215C313K366k389F49e707m851
$$ plain form
7223 -10558 -8720 -1725 649 -3022 -7669 -11928 -14724 -13121 -12298 -9242 -7699 -8609 -5183 -1152 -1226 -3053
7207 -3053 -2545 -2134 -7698 -9339 -7829 -6616 -7412 -9308 -9642 -6763 -7401 -10104 -7245 -1752 -713 -5128
7191 -5128 -10042 -12079 -11309 -11407 -15492 -13241 -9167 -10582 -12537 -12722 -13927 -14598 -12317 -9544 -9609 -14953 -19579
7174 -19579 -21960 -21741 -18681 -17620 -15072 -13074 -16523 -18248 -13210 -6581 -6086 -7966 -9633 -13960 -17763
7159 -17763 -19961 -15954 -9880 -6704 -7675 -9906 -6273 -6959 -13659 -20012 -26918 -29117 -26314 -27616 -30757
7144 -30757 -31547 -30428 -25792 -21162 -21388 -21477 -21594 -22892 -20714 -18403 -16382 -12726 -6781 -2621 -2996 -5564
7128 -5564 -8825 -10696 -12284 -12018 -13024 -11925 -11074 -13133 -13997 -15288 -19318 -19196 -19397 -19212 -15407 -12175
7112 -12175 -11594 -12411 -14103 -14067 -13205 -12072 -11893 -13617 -17136 -20417 -21106 -14794 -7727 -6798 -5973 -6522 -6432 -3259
$$ packed form
7223a0558J838a725F49c022m647m259k796J603Q23L056J543r10L426a152p4j827
7207c053N08M11n564j641J510J213p96j896l34K879o38k703K859a752g13m415
7191e128m914k037P70r8m085K251M074j415j955j85j205o71K281K773o5n344m626
7174a9579k381K19L060J061K548J998l449j725N038f581M95j880j667m327l803
7159a7763k198M007O074L176r71k231L633o86o700o353o906k199K803j302l141
7144c0757p90J119M636M630k26q9j17j298K178K311K021L656N945b621l75k568
7128e564l261j871j588K66j006J099Q51k059q64j291m030J22k01J85L805L232
7112a2175N81q17j692L6Q62J133J79j724l519l281o89O312P067R29Q25n49R0L173
$$ plain form
7094 -3259 -2994 -5466 -6884 -6270 -2260 -3469 -4725 -6853 -9922 -9684 -13668 -17317 -17338 -15911 -15376 -15470 -17622
7077 -17622 -19311 -17699 -11682 -6353 -4884 -7770 -6611 -3746 -6083 -8986 -13168 -17882 -17802 -15704 -13895
7062 -13895 -10273 -5250 -7097 -9007 -6744 -2912 -4486 -8419 -11774 -10411 -8637 -7828 -8897 -12231 -10545
7047 -10545 -5715 -5252 -5587 -8624 -11434 -9316 -9093 -11070 -10060 -10597 -14800 -17491 -16971 -11727 -4782 -190
7030 -2729 -3674 -4144 -7749 -8910 -8644 -7275 -3514 -1782 -2479 -1788 2010 7402 14453 17280 16027 12579
7014 12579 8409 -146 -8357 -15409 -18040 -13511 -7300 -3283 -2852 -2394 -4969 -7298 -10309 -12947 -14483
6999 -14483 -13957 -9148 -4423 -5485 -7967 -7935 -6537 -5058 -7931 -13163 -16480 -15841 -16495 -14769 -15800 -17324
6983 -17324 -17971 -16278 -16157 -18252 -14706 -12288 -12637 -9264 -4004 7627 15290 15807 18407 18675 16056 15726
$$ packed form
7094c259K65k472j418O14b260j209j256k128l069K38l984l649k1J427N35r4k152
7077a7622j689J612O017N329J469k886J159K865k337k903m182m714Q0K098J809
7062a3895L622N023j847j910K263b912j574l933l355J363J774Q09j069l334J686
7047a0545M830M63l35l037k810K118K23j977J010n37m203k691N20N244d782a90
7030b729r45m70l605j161K66J369c514J732o97O91B010N392P051K827j253l448
7014A2579m170a46q211p052k631M529O211c283M31M58k575k329l011k638j536
6999a4483N26M809d423j062k482L2J398J479k873n232l317O39o54J726j031j524
6983a7324o47J693J21k095L546K418l49L373d004G627P663N17K600K68k619l30
$$ plain form
6967 15726 13093 6184 -1226 -4599 -4493 -5768 -7025 -11365 -15044 -14489 -13892 -12184 -6819 -3543 -5998
6952 -5998 -7733 -10139 -12565 -10176 -12809 -21456 -28724 -27985 -24401 -21382 -19622 -21086 -18596 -10727 -4669
6936 -624 -3618 -7756 -11027 -7238 741 2463 -1569 -8258 -13229 -17163 -17522 -17452 -12869 -9572 -9186 -7820
6920 -7820 -7690 -5474 -4585 -7493 -8999 -11809 -14882 -16286 -20362 -18858 -11073 -8561 -12891 -18977 -25652
6905 -25652 -31577 -30734 -24412 -21275 -19986 -12896 -3940 -5326 -9970 -10077 -8389 -6904 -2828 940 2557
6890 2557 4099 2977 1040 -4200 -10437 -9693 -3785 -1537 -1361 -3694 -6306 -4245 -2905 -2234 -4031 -5072
6874 -5072 -4072 -2779 -2518 -1731 -2889 -6028 -13544 -15404 -12884 -13725 -17255 -19175 -17552 -13648 -8043 -4856
6858 -4856 -4131 -6223 -10630 -10491 -8151 -8277 -7150 -5461 -1772 2871 4893 5040 2565 -694 -6115 -12256
$$ packed form
6967A5726k633F184a226l373J06j275j257m340l679N55N97J708N365L276k455
6952e998j735k406k426K389k633q647p268P39L584L019J760j464K490P869d669
6936f24k994m138l271L789G41J722a569o689m971l934l59P0M583L297L86J366
6920g820J30K216Q89k908j506k810l073j404m076J504P785K512m330o086o675
6905b5652n925Q43O322L137J289P090c940j386m644j07J688J485b828I40J617
6890B557J542j122A040d200o237P44c785a537J76k333k612K061J340O71j797j041
6874e072J000J293K61P87j158l139p516j860K520q41l530j920J623L904N605L187
6858d856P25k092m407J39K340j26J127J689a772B871K022J47k475f94n421o141
$$ plain form
6842 -12256 -13936 -12017 -11064 -10635 -8192 -5596 -2338 2287 4198 4198 5137 2891 891 1086 -1626 -8639 -12567
6825 -12567 -8669 -949 7431 18135 22902 20561 18778 21060 24362 25002 25425 23082 22190 20251 17895
6810 17895 19276 19706 17248 13195 12339 12456 9635 6531 5876 2405 383 4208 8352 6857 1937 2530
6794 2530 8276 11213 12743 12806 11265 12837 16161 19360 19381 17593 13389 8553 10987 13438 9398 7620
6778 7620 6963 4428 118 -1191 -2712 -5676 -6550 -4367 -3714 -1170 -50 -225 -415 1209 3930 2045 1418
6761 1418 3297 3649 -1894 -11841 -18814 -17762 -13315 -8056 -5811 -6475 -6542 -2097 103 -2829 -3111 -2357 -1718
6744 -1718 -1922 -483 -1673 -1942 2784 10050 14015 17012 18331 18610 15184 13098 13760 14126 15159 14644 11951
6727 11951 9082 7798 10092 10739 6588 5217 7620 11888 16516 21068 21273 22498 24030 22258 23260
$$ packed form
6842a2256j680J919R53M29K443K596b338B287J911%R39k246H91J95a626p013l928
6825a2567L898i49G431J0704M767k341j783K282L302O40M23k343q92j939k356
6810A7895J381M30k458m053q56J17k821l104o55B405C83L825M144j495A937N93
6794B530N746K937J530O3j541J572L324L199K1j788m204m836K434K451m040j778
6778G620o57k535A18a191j521k964q74K183O53a170e0j75j90A209K721j885o27
6761A418J879L52a894r947o973J052M447N259K245o64o7b097A03b829k82P54O39
6744a718k04d83j190k69B784P266L965K997J319K79l426k086O62L66J033n15k693
6727A1951k869j284K294O47m151j371K403M268M628M552K05J225J532j772J002
$$ plain form
6712 23260 26033 27649 27189 25613 23448 25367 29549 29515 27157 29872 35855 37957 40700 38743 31904
6697 31904 33156 39746 43097 41684 39757 37727 35925 36175 38658 42876 46928 47513 44070 38011 37279
6682 37279 41150 45078 48282 52492 56079 59055 63485 69785 75698 78032 78461 77789 78393 73378 68575
6667 68575 67096 73006 80232 82077 83981 86268 83917 83371 83499 84044 88754 95939 98894 100062 103777
6652 103777 110839 119403 124729 125829 123250 121070 124257 130921 136237 136950 137698 139557 141593 151437 165389
6637 165389 177041 185875 193960 201552 204273 209820 216366 220208 227935 238317 253409 269620 287176
6624 287176 300833 316260 332466 344864 358280 376819 397725 421174 444256 470913 500775 535704
6612 535704 571820 604797 638688 677285 718938 766268 821134 879394 939463 1007231 1084526 1166770
$$ packed form
6712B3260K773J616m60j576k165J919M182l4k358K715N983K102K743j957o839
6697C1904J252O590L351j413j927k030j802K50K483M218M052N85l443o059p32
6682C7279L871L928L204M210L587K976M430O300N913K334M29o72O04n015m803
6667F8575j479N910P226J845J904K287k351n46J28N45M710P185K955J168L715
6652A03777P062Q564N326J100k579k180L187O664N316P13P48J859K036R844J3952
6637A65389J1652Q834Q085P592K721N547O546L842P727J0382J5092J6211J7556
6624B87176J3657J5427J6206J2398J3416J8539K0906K3449K3082K6657K9862L4929
6612E35704L6116L2977L3891L8597M1653M7330N4866N8260O0069O7768P7295Q2244
$$ plain form
6600 1166770 1255036 1347233 1445735 1557350 1683603 1822933 1967222 2123209 2290237 2467596
6590 2467596 2665801 2882951 3117629 3365917 3626234 3895420 4172755 4456477 4738496 5017413
6580 5017413 5292044 5561787 5832689 6108820 6390278 6675174 6958365 7234680 7495894 7723291
6570 7723291 7893469 7989594 8004014 7936741 7784763 7555313 7272965 6958990 6634891 6313769
6560 6313769 6000059 5698274 5407187 5124778 4846640 4569373 4288815 4010175 3736648 3466326
6550 3466326 3203818 2954946 2721344 2502203 2296897 2105619 1931697 1777419 1641549 1520446
6540 1520446 1411952 1308982 1215611 1136570 1061561 988771 921848 863262 811544 763837 724319
6529 724319 684430 641507 603003 568275 537498 509348 484145 462228 444003 424953 402743 380063
$$ packed form
6600A166770Q8266R2197R8502J11615J26253J39330J44289J55987J67028J77359
6590B467596J98205K17150K34678K48288K60317K69186K77335K83722K82019K78917
6580E017413K74631K69743K70902K76131K81458K84896K83191K76315K61214K27397
6570G723291J70178R6125J4420o7273j51978k29450k82348l13975l24099l21122
6560F313769l13710l01785k91087k82409k78138k77267k80558k78640k73527k70322
6550C466326k62508k48872k33602k19141k05306j91278j73922j54278j35870j21103
6540A520446j08494j02970r3371p9041p5009p2790o6923n8586n1718m7707l9518
6529G24319l9889m2923l8504l4728l0777k8150k5203k1917j8225j9050k2210k2680
$$ plain form
6517 380063 358279 339776 326030 309310 289037 272403 264145 257172 249985 241071 229331 220059 211926
6504 211926 207453 206006 201026 193825 186896 177889 168257 158117 149006 143219 143300 142249 136708 130682 131875
6489 131875 127722 120407 116231 112574 108306 103311 96307 91025 88207 92463 94868 91383 90275 90222 85709
6474 85709 76013 69704 67800 64922 64077 61905 62024 63547 66140 67924 68750 67631 65179 59587 56878
6459 56878 54584 51713 51338 46843 40306 40604 42752 45149 51555 56410 52556 42770 39599 36510 35798
6444 35798 39618 40883 36866 32146 26979 26203 28169 30096 31788 32513 30491 27108 24577 22062 19243
6429 19243 14007 12239 11734 14821 17297 19089 23803 24990 22303 22098 21486 17691 15124 15566 20829 24432
6413 24432 24810 22129 17690 11819 7953 5567 2389 1035 114 -95 1949 2065 -1291 -3560 -2166 1495
$$ packed form
6517C80063k1784j8503j3746j6720k0273j6634q258o973p187q914j1740r272q133
6504B11926m473j447m980p201o929r007r632j0140r111n787Q1j051n541o026J193
6489A31875m153p315m176l657m268m995p004n282k818M256K405l485j108n3m513
6474H5709r696o309j904k878q45k172J19J523K593J784Q26j119k452n592k709
6459E6878k294k871l75m495o537K98K148K397O406M855l854r786l171l089p12
6444C5798L820J265m017m720n167p76J966J927J692P25k022l383k531k515k819
6429A9243n236j768n05L087K476J792M714J187k687k05o12l795k567M42N263L603
6413B4432L78k681m439n871l866k386B389A035A14i5A949J16a291k269J394A495
$$ plain form
6396 3820 3412 3025 4307 6208 5179 -237 -3531 -5486 -3190 366 -2164 -5381 -4223 827 5718 9304
6380 9304 6775 2306 706 -3894 -6398 -8663 -8395 -4017 1910 5683 7670 5980 3709 4626 952 -1329
6363 -938 3117 4830 1371 -3865 -4214 1256 7116 7463 6194 4949 2655 3486 3578 2187 4304 4423 8550
6346 8550 10556 9130 5641 4313 7206 10562 14588 15923 12762 9783 5458 144 598 1738 2065 3512
6330 3512 8068 11256 12179 17327 24489 26941 25090 19912 10135 3737 -1363 -6272 -7048 -5385 -7534
6315 -7534 -6478 -6872 -8832 -9646 -5760 -1827 -3151 -1376 4460 6080 3392 1627 -2101 -5694 -5407 -3901
6299 -3901 -2386 795 1450 1210 2157 2798 2032 -1964 -6172 -7405 -9113 -12497 -10683 -5436 -5757 -9418 -11368
6282 -11368 -13915 -14248 -16857 -17395 -14895 -13096 -15442 -14742 -11628 -9851 -7152 -4037 -6952 -11838 -12803 -9597
$$ packed form
6396C820m08l87J282J901j029b37l294j955K296C66b164l217J158H27M891L586
6380I304k529B306G06c894k504k265K68d017A910L773J987j690k271R17I52a329
6363i38C117J713A371c865l49A256N860L47j269j245k294Q31R2j391K117J19M127
6346H550K006j426l489j328K893L356M026J335l161k979m325A44M54J140L27J447
6330C512M556L188R23N148P162K452j851n178r777C737a363m909p76J663k149
6315g534J056l94j960q14L886a827j324a376D460J620k688A627b101l593K87J506
6299c901J515G95O55k40R47O41p66a964m208j233j708l384J814N247l21l661j950
6282a1368k547l33k609n38K500J799k346P00L114J777K699L115k915m886r65L206
$$ plain form
6266 -9597 -5640 -6729 -12982 -18651 -16034 -11316 -11950 -14330 -15302 -14802 -15411 -19014 -22859 -23136 -22327 -18775
6250 -18775 -11887 -9652 -9490 -12326 -14203 -15600 -18736 -25496 -32402 -33600 -28571 -22112 -14655 -8244 585
6234 5737 2383 -5159 -13343 -11987 -6989 -8020 -8770 -8236 -6403 -887 4778 6048 3826 3162 3521 2144
6218 2144 2978 7314 12022 12107 13727 18347 21262 21258 20544 19864 20502 26318 34178 45818 62135 87749
6202 87749 127849 190421 276661 347197 345699 270072 184928 130129 104056 92744 91358 98998
6190 98998 119785 158911 227854 348888 527215 680459 687423 539821 358469 233533 165410
6179 165410 131260 112466 100786 98463 107417 135231 187705 264103 336347 346775 274501 181814
6167 181814 120593 84806 61944 46431 33681 25882 22013 18011 10368 6627 10053 15693 17249
$$ packed form
6266i597L957j089o253n669K617M718o34k380r72N00o09l603l845k77Q09L552
6250a8775O888K235J62k836j877j397l136o760o906j198N029O459P457O411E85
6234E737B383e159q184J356M998j031p50N34J833h87D778J270k222o64L59j377
6218B144Q34M336M708Q5J620M620K915mp14o80O38N816P860J1640J6317K5614
6202H7749M0100O2572Q6240P0536j498p5627q5144n4799k6073j1312j386P640
6190I8998K0787L9126O8943J21034J78327J53244O964j47602j81352j24936o8123
6179A65410l4150j8794j1680k323Q954K7814N2474P6398P2244J0428p2274r2687
6167A81814o1221l5787k2862j5513j2750p799l869m002p643l741L426N640J556
$$ plain form
6154 17249 13259 10070 7744 4596 -982 -5555 -6797 -3035 5742 16860 20474 25812 39349 54214
6140 54214 69161 82188 78448 62910 47703 36307 29676 28160 24165 18756 18466 25558 34207 45491
6126 45491 67208 99005 141422 182611 190535 152582 102025 67542 51119 41764 38092 34312 26741
6113 26741 22440 28342 40050 48898 60205 73138 83054 81341 64672 47308 34372 23780 17825
6100 17825 15857 15408 9960 6748 16421 29240 31398 28110 23009 19822 17172 13213 12289 11989 9690
6085 9690 10726 16381 23193 31061 42337 53448 57791 62854 62808 53259 43043 31816 18590 13270
6071 13270 15823 17270 18885 24508 33964 47264 62044 74980 86771 95967 96270 86875 69993 53834
6057 53834 40033 30442 22524 19337 23306 29155 27376 26889 38180 50748 54386 57630 62374 61634
$$ packed form
6154A7249l990l189k326l148i82m573j242c035E742J1118L614N338J3537J4865
6140E4214J4947J3027l740j5538j5207j1396o631j516l995n409k90P092Q649J1284
6126D5491K1717L1797M2417M1189P924l7953n0557l4483j6423r355l672l780p571
6113B6741m301N902J1708Q848J1307J2933R916j713j6669j7364j2936j0592n955
6100A7825j968m49n448l212R673J2819K158l288n101l187k650l959r24l00k299
6085I690J036N655O812P868J1276J1111M343N063m6r549j0216j1227j3226n320
6071A3270K553J447J615N623R456J3300J4780J2936J1791R196L03r395j6882j6159
6057E3834j3801r591p918l187L969N849j779m87J1291J2568L638L244M744p40
$$ plain form
6043 61634 54028 43596 35499 30284 24712 19539 15065 11125 9017 11538 12465 13865 10550 8529 13302
6028 13302 15593 19980 25553 26882 26076 22839 23379 29348 34190 35705 39064 44010 45346 48684 49587
6013 49587 50876 54815 60258 64718 63391 59992 58448 62272 71134 77478 75697 75158 77400 80746 85223
5998 85223 90024 94152 100298 107546 113979 121153 126442 122990 122305 131010 141960 150176 157390 164940 170448
5983 170448 176690 188353 203809 222375 239697 247433 251129 257051 260243 262868 273043 283898 293472
5970 293472 305060 314141 325785 337734 348567 359739 367331 371082 373075 376177 381380 384967 388583
5957 388583 393060 397413 398838 397833 395580 395211 393974 389121 381134 372520 364406 354888 344658 331595
5943 331595 317708 307054 297234 289842 282050 272528 262555 253135 244699 233262 223615 212182 201799
$$ packed form
6043F1634p606j0432q097n215n572n173m474l940k108K521R27J400l315k021M773
6028A3302K291M387N573J329q06l237N40N969M842J515L359M946J336L338R03
6013D9587J289L939N443M460j327l399j544L824Q862O344j781n39K242L346M477
5998H5223M801M128O146P248O433P174N289l452o85Q705J0950Q216P214P550N508
5983A70448O242J1663J5456J8566J7322P736L696N922L192K625J0175J0855R574
5970B93472J1588R081J1644J1949J0833J1172P592L751J993L102N203L587L616
5957C88583M477M353J425j005k253l69j237m853p987q614q114r518j0230j3063
5943C31595j3887j0654r820p392p792r522r973r420q436j1437r647j1433j0383
$$ plain form
5930 201799 193047 184167 173056 163837 154871 147095 143063 136066 127953 120993 114847 109119 108271 105454
5916 105454 101262 96370 93956 92495 90034 84276 75339 67009 61208 56422 53642 49309 44068 40756
5902 40756 41748 43992 44754 42836 38027 33920 33210 35210 32197 24205 17218 15166 14619 15948 17889 20338
5886 20338 17135 12348 12298 12345 10259 13093 16816 17517 16083 8493 3794 6707 8032 4899 1530 -3284
5869 -9359 -9905 -8404 -9844 -11429 -8229 -6040 -8717 -9677 -11458 -12814 -11208 -12270 -15657 -14976 -9941 -7789
5853 -7789 -11782 -16028 -21015 -24154 -26740 -26691 -21002 -18503 -25918 -26472 -19962 -16730 -15400 -16504 -16519 -16612 -18988
5836 -18988 -19732 -19654 -13673 -1920 3481 1227 -2369 -5108 -9199 -18953 -28624 -30287 -26143 -18201 -10822
5821 -10822 -2234 7324 17468 27562 34572 31980 21423 11075 2808 -7422 -16927 -24376 -27350 -25391
$$ packed form
5930B01799q752q880j1111r219q966p776m032o997q113o960o146n728q48k817
5916A05454m192m892k414j461k461n758q937q330n801m786k780m333n241l312
5902D0756R92K244P62j918m809m107p10K000l013p992o987k052n47J329J941K449
5886B0338l203m787n0M7k086K834L723P01j434p590C794K913J325l133A530c284
5869i359n46J501j440j585L200K189k677r60j781j356J606j062l387O81N035K152
5853g789l993m246m987l139k586M9N689K499p415n54O510L232J330j104j5r3k376
5836a8988p44P8N981a920C481A227b369k739m091r754r671j663M144P942P379
5821a0822b234G324J0144J0094P010k592j0557j0348B808g422r505p449k974J959
$$ plain form
5807 -25391 -22710 -19583 -15295 -12127 -5815 -1767 -5869 -12525 -20159 -23797 -23384 -23247 -22547 -23188 -25923 -26352
5791 -26352 -25796 -24669 -24219 -25376 -28158 -29657 -32410 -33967 -32075 -28469 -24645 -24916 -26148 -26593 -26286 -26935
5775 -26935 -30749 -34198 -35849 -39611 -42449 -40912 -39969 -40303 -41813 -42459 -45223 -46083 -45787 -43436 -41280 -43226
5759 -43226 -47883 -54122 -58463 -56081 -46601 -41084 -44012 -46467 -46700 -47899 -47297 -43364 -43243 -44936 -45540 -44173
5743 -44173 -41770 -40298 -39947 -39084 -35715 -32552 -29227 -24520 -24329 -29464 -34272 -33203 -33169 -35679 -30759 -24844
5727 -24844 -23500 -24596 -23920 -21864 -22069 -19016 -20130 -21641 -21353 -21627 -25136 -29214 -29742 -25336 -20852 -24328
5711 -24328 -31240 -32118 -31675 -31684 -33608 -36064 -36651 -38081 -34091 -23757 -17532 -18702 -21503 -23581 -26981 -25787
5695 -25787 -16213 -516 10412 8352 6952 8236 434 -5675 -6920 -11031 -19795 -30785 -31314 -27746 -27133
$$ packed form
5807b5391K681L127M288L168e815a767m102o656p634l638M13J37P00o41k735m29
5791b6352N56J127M50j157k782j499k753j557J892L606L824k71j232m45L07o49
5775b6935l814l449j651l762k838J537R43l34j510o46k764q60K96K351K156j946
5759d3226m657o239m341K382R480N517k928k455k33j199O02L933J21j693o04J367
5743d4173K403J472L51Q63L369L163L325M707J91n135m808J069L4k510M920N915
5727b4844J344j096O76K056k05L053j114j511K88k74l509m078n28M406M484l476
5711b4328o912q78M43rj924k456n87j430L990J0334O225j170k801k078l400J194
5695b5787R574e16A0412k060j400J284D34e675j245m111q764j0990n29L568O13
$$ plain form
5680 -27133 -25449 -20170 -10761 2732 24356 51780 69248 75487 67743 41421 14211 -1279 -8989
5667 -8989 -15360 -19602 -20947 -22658 -26390 -28438 -22991 -14164 -5845 2095 11993 19166 14118 8507 -1925
5651 -19804 -28592 -28599 -27391 -27973 -27516 -29479 -30860 -30591 -24763 -18912 -20604 -26039 -29011 -29327 -31044 -33399
5635 -33399 -38555 -41426 -41613 -39550 -33310 -27671 -26273 -28689 -27909 -24874 -20773 -18135 -15608 -15685 -13160 -14374
5619 -14374 -19511 -23299 -26755 -26011 -25985 -28010 -29187 -27366 -28579 -27666 -25081 -25418 -25940 -25977 -26923 -25269 -23721
5602 -23721 -26084 -31346 -32115 -30557 -29841 -26691 -25543 -28060 -29706 -28895 -23926 -20811 -21326 -24795 -24446 -23049
5586 -23049 -19812 -17791 -16618 -14675 -7545 -1468 -3991 -5818 -2643 -599 -3598 -12421 -21119 -23737 -20555
5571 -20555 -17133 -14701 -10959 -4778 -2209 2202 12206 21997 25725 21912 10524 3329 -1672 -4084
$$ packed form
5680b7133J684N279R409B732K1624K7424J7468O239p744k6322A4211a279p710
5667h989o371m242j345j711l732k048N447Q827e845B095R898P173n048n611a925
5651a9804q788pJ208n82M57j963j381K69N828N851j692n435k972l16j717k355
5635c3399n156k871j87K063O240N639J398k416P80L035M101K638K527p7K525j214
5619a4374n137l788l456P44K6k025j177J821j213R13K585l37n22l7r46J654J548
5602b3721k363n262p69J558P16L150J148k517j646Q11M969L115n15l469L49J397
5586b3049L237K021J173J943P130a468k523j827b643e99k999q823q698k618L182
5571b0555L422K432L742d778b209B202J0004R791L728l813A0524C329a672k412
$$ plain form
5557 -4084 1618 11741 15310 10008 2666 200 -3119 -6466 -5844 -7487 -8262 -8058 -9339 -9635 -11531 -13820
5541 -13820 -14044 -11579 -8482 -2686 -420 -2494 -736 1910 3008 7173 13820 13606 6121 -1255 -4720 2138
5524 12386 16531 21703 20292 17284 11230 8753 12433 13710 15120 13877 12325 6924 1663 4041 5758
5509 5758 7161 7664 4892 293 -74 1033 3099 2774 4183 7541 9232 9075 7973 9899 12093 12402 12278
5492 12278 12572 13832 13669 10707 7176 8990 11558 12387 10743 8810 13741 22810 28994 30975 28416
5477 28416 25289 23307 20451 18334 20270 25795 32032 36354 35815 34004 38440 45035 52339 57291 60777
5462 60777 68496 87773 110123 139418 176791 224003 279937 334902 364175 371821 399392 438836
5450 438836 429695 368351 315365 293232 279907 261427 253599 273356 317329 371312 407765 418141
$$ packed form
5557d084A618J0123L569n302B666B00c119l347O22j643p75K04j281k96j896k289
5541a3820k24K465L097b686d20k074g36A910J098M165O647k14F121a255l465B138
5524A2386M145N172j411l008o054k477L680J277J410j243j552n401A663K378J717
5509E758J403N03k772B93g4A033K066l25J409L358J691j57j102J926K194L09j24
5492A2278K94J260j63k962l531J814K568Q29j644j933M931R069O184J981k559
5477B8416l127j982k856k117J936N525O237M322n39j811M436O595P304M952L486
5462F0777P719J9277K2350K9295L7373M7212N5934N4965K9273P646K7571L9444
5450D38836r141o1344n2986k2133j3325j8480p828J9757M3973N3983L6453J0376
$$ plain form
5438 418141 436229 476734 492331 444559 375303 340244 320952 289535 250382 225272 220971 234075
5426 234075 260138 297834 337383 370640 426004 522574 602719 599163 556358 546479 549308 506384
5414 506384 436683 387460 361107 360313 382236 401871 417745 465198 548320 595662 570425 534147
5402 534147 528822 515210 459293 385901 324130 278119 244334 219948 201705 186892 176501 174079
5390 174079 178490 182022 181340 178679 179438 179213 175020 166955 158496 152423 147142 141793 138301 139584 146660
5375 146660 151268 148821 148707 148392 143097 140123 139123 135471 128890 121347 117967 119104 117412 113185 111086
5360 111086 115338 120826 121920 121779 121700 121061 122399 124904 126858 134184 141136 144839 147786 150857 159943
5345 159943 172666 181984 192990 202348 210418 226021 249031 276808 307137 341257 382108 435808
$$ packed form
5438D18141J8088M0505J5597m7772o9256l5059j9292l1417l9153k5110m301J3104
5426B34075K6063L7696L9549L3257N5364R6570Q0145l556m2805r879K829m2924
5414E06384o9701m9223k6353p94K1923J9635J5874M7453Q3122M7342k5237l6278
5402E34147n325j3612n5917p3392o1771m6011l3785k4386j8243j4813j0391k422
5390A74079M411L532o82k661P59k25m193q065q459o073n281n349l492J283P076
5375A46660M608k447j14l15n295k974j000l652o581p543l380J137j692m227k099
5360A11086M252N488J094j41p9o39J338K505J954P326O952L703K947L071R086
5345A59943J2723R318J1006R358Q070J5603K3010K7777L0329L4120M0851N3700
$$ plain form
5333 435808 509985 613973 750903 914124 1092974 1256083 1369549 1416224 1412874 1388845 1369207
5322 1369207 1370334 1396627 1454527 1551804 1697137 1890033 2119620 2361325 2589393 2779619
5312 2779619 2918345 2989832 2975519 2883413 2737223 2580122 2451923 2373160 2352701 2390595 2479927
5301 2479927 2617738 2782263 2939619 3048938 3081426 3029297 2901447 2719380 2495170 2256617
5291 2256617 2034210 1848478 1705404 1606851 1553002 1534720 1545494 1577773 1611273 1625530 1593102
5280 1593102 1488149 1327015 1147164 976971 837105 728837 648376 592126 545929 515454
5270 515454 498716 487081 472240 461099 454082 446089 435103 425185 421379 417796 411789 407353 407597
5257 407597 412429 418931 421070 425094 432453 438229 439980 439940 437756 436169 440571 447687 457920 474873
$$ packed form
5333D35808P4177J03988J36930J63221J78850J63109J13466M6675l350k4029j9638
5322A369207J127K6293N7900R7277J45333J92896K29587K41705K28068J90226
5312B779619J38726P1487j4313r2106j46190j57101j28199p8763k0459L7894Q9332
5301B479927J37811J64525J57356J09319L2488n2129j27850j82067k24210k38553
5291B256617k22407j85732j43074r8553n3849j8282J0774L2279L3500J4257l2428
5280A593102j04953j61134j79851j70193j39866j08268q0461n6250m6197l0475
5270E15454j6738j1635j4841j1141p017p993j0986r918l806l583o007m436K44
5257D07597M832O502K139M024P359N776J751m0k184j587M402P116J0233J6953
$$ plain form
5243 474873 492024 506374 513538 517579 526517 542664 567173 597352 625057 650902 679182 716227
5231 716227 752319 747277 728906 725515 732966 745305 763075 779490 790918 798971 814069 839259
5219 839259 866214 886996 902556 908429 910807 915950 933331 956682 975716 992959 1006984 1020780
5207 1020780 1040421 1064251 1089882 1117497 1140970 1166990 1197407 1227656 1255470 1283508 1317916
5196 1317916 1353591 1388232 1424342 1465540 1510470 1558724 1620651 1700299 1800417 1931106 2118219
5185 2118219 2419501 2904256 3373584 3260736 2909005 2715401 2637566 2615215 2623858 2661125
5175 2661125 2719321 2794312 2884613 2990215 3111183 3243937 3382225 3514464 3636054 3746695
5165 3746695 3851738 3959696 4080703 4222187 4390179 4584141 4806177 5061780 5359963 5708441
$$ packed form
5243D74873J7151J4350P164M041Q938J6147K4509L0179K7705K5845K8280L7045
5231G16227L6092n042j8371l391P451J2339J7770J6415J1428Q053J5098K5190
5219H39259K6955K0782J5560N873K378N143J7381K3351J9034J7243J4025J3796
5207A020780J9641K3830K5631K7615K3473K6020L0417L0249K7814K8038L4408
5196A317916L5675L4641L6110M1198M4930M8254O1927P9648J00118J30689J87113
5185B118219L01282M84755M69328j12848l51731j93604p7835k2351Q643L7267
5175B661125N8196P4991R0301J05602J20968J32754J38288J32239J21590J10641
5165C746695J05043J07958J21007J41484J67992J93962K22036K55603K98183L48478
$$ plain form
5155 5708441 6115318 6572965 7050334 7515331 7941578 8331454 8714146 9127130 9594897 10130482
5145 10130482 10754675 11498445 12383146 13421364 14628143 16021460 17613541 19416989 21470868
5136 21470868 23847751 26634903 29954271 34003420 39057012 45492456 53833075 64785799
5128 64785799 79311966 98568636 123554213 154190807 187773099 218116595 238156730
5121 238156730 245268436 242965031 237154192 232483739 231680769 236331249 247538033 266206931
5113 266206931 293040245 328106244 369856060 414250750 455625556 489477764 513313857
5106 513313857 524440976 520271342 501775654 474630453 446391651 423213423 408732723
5099 408732723 404592999 411247950 428267428 453890165 484154724 512465117 531114965
$$ packed form
5155E708441M06877M57647M77369M64997M26247L89876L82692M12984M67767N35585
5145A0130482O24193P43770Q84701J038218J206779J393317J592081J803448K053879
5136B1470868K376883K787152L319368M049149N053592O435444Q340619J0952724
5128F4785799J4526167J9256670K4985577L0636594L3582292L0343496K0040135
5121B38156730P111706k303405n810839m670453q02970M650480J1206784J8668898
5113B66206931K6833314L5065999M1749816M4394690M1374806L3852208K3836093
5106E13313857J1127119m169634j8495688k7145201k8238802k3178228j4480700
5099D08732723m139724O654951J7019478K5622737L0264559K8310393J8649848
$$ plain form
5092 531114965 534916657 523641863 500031221 466385178 425099556 380888447 339506959
5085 339506959 304961073 278753784 260822556 250487504 246853087 248809603 254642964
5078 254642964 261358270 263909263 256076235 234550520 202618411 167806141 136233544
5071 136233544 110369235 90237921 74875197 63123160 54006421 46842491 41140571
5064 41140571 36504450 32648997 29387466 26587032 24152726 22017858 20149576 18531957
5056 18531957 17150257 15979581 14952643 14017257 13199244 12510169 11934947 11430041 10947424
5047 10947424 10487761 10057074 9630086 9191086 8762520 8339107 7935644 7582235 7311954
5038 7311954 7102673 6891097 6629568 6322334 6014309 5773664 5598835 5440075 5286393 5173417
$$ packed form
5092E31114965L801692j1274794k3610642l3646043m1285622m4211109m1381488
5085C39506959l4545886k6207289j7931228j0335052l634417J956516N833361
5078B54642964O715306K550993p833028k1525715l1932109l4812270l1572597
5071A36233544k5864309k0131314j5362724j1752037r116739p163930n701920
5064D1140571m636121l855453l261531k800434k434306k134868j868282j617619
5056A8531957j381700j170676j026938r35386q18013o89075n75222n04906m82617
5047A0947424m59663m30687m26988m39000m28566m23413m03463l53409k70281
5038G311954k09281k11576k61529l07234l08025k40645j74829j58760j53682j12976
$$ plain form
5028 5173417 5112869 5087013 5066828 5003742 4860374 4655328 4444061 4254536 4099267 3970700
5018 3970700 3852464 3742710 3651327 3593328 3577419 3594130 3617735 3645420 3696147 3742299 3691372
5007 3691372 3539677 3362093 3180492 3003900 2868345 2787880 2726156 2627959 2512973 2414263
4997 2414263 2345560 2310078 2291702 2280034 2264231 2212917 2125709 2034165 1951947 1877746 1810707
4986 1810707 1753557 1704836 1658913 1616684 1580746 1553876 1534654 1511062 1480946 1453190 1428872
4975 1428872 1407362 1382545 1353714 1318231 1281762 1244350 1209341 1179796 1153996 1135165 1125429 1117041
4963 1117041 1105533 1096552 1089868 1086317 1084043 1084185 1082163 1075499 1063742 1045655 1026072 1012396 1004670
4950 1004670 1005182 1008268 1009049 1008321 1010663 1018122 1032301 1049772 1064786 1078391 1091919 1104427 1117811
$$ packed form
5028E173417o0548k5856k0185o3086j43368k05046k11267j89525j55269j28567
5018C970700j18236j09754r1383n7999j5909J6711K3605K7685N0727M6152n0927
5007C691372j51695j77584j81601j76592j35555q0465o1724r8197j14986r8710
4997B414263o8703l5482j8376j1668j5803n1314q7208r1544q2218p4201o7039
4986A810707n7150m8721m5923m2229l5938k6870j9222k3592l0116k7756k4318
4975A428872k1510k4817k8831l5483l6469l7412l5009k9545k5800j8831r736q388
4963A117041j1508q981o684l551k274J42k022o664j1757j8087j9583j3676p726
4950A004670N12L086P81p28K342P459J4179J7471J5014J3605J3528J2508J3384
$$ plain form
4937 1117811 1131914 1155632 1189979 1220976 1255409 1297543 1348695 1414984 1509249 1630117 1772814
4926 1772814 1933172 2094911 2229736 2318281 2366402 2411972 2483657 2593184 2745106 2933987
4916 2933987 3165988 3448881 3771557 4106643 4431812 4727186 5005428 5294457 5590772 5834941
4906 5834941 5967158 6010595 6056839 6183277 6417662 6755304 7177522 7647081 8135982 8628741
4896 8628741 9105214 9548000 9950955 10317332 10666177 11014107 11346244 11590423 11750185 11916193
4886 11916193 12147308 12454867 12815234 13176327 13493228 13742294 13917909 14031072 14101572 14174595
4876 14174595 14292583 14481201 14742662 15040459 15315625 15524086 15666983 15751560 15789643 15781955
4866 15781955 15712130 15554026 15298277 14950303 14500456 13949090 13336942 12717410 12112309 11543810
$$ packed form
4937A117811J4103K3718L4347L0997L4433M2134N1152O6289R4265J20868J42697
4926A772814J60358J61739J34825Q8545M8121M5570P1685J09527J51922J88881
4916B933987K32001K82893L22676L35086L25169K95374K78242K89029K96315K44169
4906E834941J32217M3437M6244J26438K34385L37642M22218M69559M88901M92759
4896H628741M76473M42786M02955L66377L48845L47930L32137K44179J59762J66008
4886A1916193K31115L07559L60367L61093L16901K49066J75615J13163P0500P3023
4876A4174595J17988J88618K61461K97797K75166K08461J42897Q4577L8083p688
4866A5781955o9825j58104k55749l47974m49847n51366o12148o19532o05101n68499
$$ plain form
4856 11543810 11040429 10603311 10221821 9876530 9550747 9232685 8926471 8618383 8291073
4847 8291073 7968576 7654570 7320275 6945444 6535648 6109011 5666697 5215506 4763975 4314765
4837 4314765 3891319 3505359 3165790 2874788 2626521 2407180 2202137 2018405 1855571 1709625
4827 1709625 1581472 1475220 1390532 1324153 1266337 1207178 1141892 1075410 1013912 966015 932641
4816 932641 904342 862929 810155 763780 724769 692823 667273 639372 617329 600463 585946 568772
4804 568772 544603 522859 505534 490947 476804 467576 456104 439941 421711 406905 395009 383963
4792 383963 376734 374497 368399 359181 348612 341842 338882 336843 337404 337442 337274 332283 325437 326358 331371
4777 331371 343665 356751 358830 344421 323852 307547 300999 300685 296231 291689 288954 287820 289660
$$ packed form
4856A1543810n03381m37118l81490l45291l25783l18062l06214l08088l27310
4847H291073l22497l14006l34295l74831m09796m26637m42314m51191m51531m49210
4837D314765m23446l85960l39569k91002k48267k19341k05043j83732j62834j45946
4827A709625j28153j06252q4688o6379n7816n9159o5286o6482o1498m7897l3374
4816I32641k8299m1413n2774m6375l9011l1946k5550k7901k2043j6866j4517j7174
4804E68772k4169k1744j7325j4587j4143r228j1472j6163j8230j4806j1896j1046
4792C83963p229k237o098r218j0569o770k960k039N61L8j68m991o846R21N013
4777C31371J2294J3086K079j4409k0569j6305o548l14m454m542k735j134J840
$$ plain form
4764 289660 289314 291545 294618 300876 317308 346449 384679 410337 398935 359316 321848 293994 277182
4751 277182 267440 261123 258662 260477 261779 261984 263916 269542 277004 293597 319488 348057 364629 351309
4737 351309 315428 285381 270948 263242 260985 259058 258997 258397 253286 246270 240778 236834 236545 245890 260515
4722 260515 267724 258900 245432 236236 229635 227197 220257 213082 211102 212553 210049 203872 199171 191113
4708 191113 183715 180392 178852 176703 176822 177301 180299 180390 176128 170388 165834 163614 167549 170142 168893
4693 168893 167980 165492 162573 160632 159943 157458 154650 153605 153329 152707 155257 160793 168297 174045 176697
4678 176697 179699 184155 182099 178402 173653 172567 175076 176729 174824 171860 174161 178186 180124 182344
4664 182344 181544 177617 174950 172203 169370 166764 162758 157949 155395 156692 160310 160072 161098 161946 156479
$$ packed form
4764B89660l46K231L073O258J6432K9141L8230K5658j1402l9619l7468k7854j6812
4751B77182r742o317k461J815J302K05J932N626P462J6593K5891K8569J6572j3320
4737C51309l5881l0047j4433p706k257j927o1o00n111p016n492l944k89R345J4625
4722B60515P209q824j3468r196o601k438o940p175j980J451k504o177m701q058
4708A91113p398l323j540k149J19M79K998R1m262n740m554k220L935K593j249
4693A68893r13k488k919j941o89k485k808j045k76o22K550N536P504N748K652
4678A76697L002M456k056l697m749j086K509J653j905k964K301M025J938K220
4664A82344q00l927k667k747k833k606m006m809k554J297L618k38J026Q48n467
$$ plain form
4649 156479 147915 140665 134586 129098 122156 112925 112398 115174 117673 116281 112491 108225 106215 103527 96794
4634 96794 92721 94534 94872 90448 83249 80284 84666 88945 90192 88891 83330 77787 76537 76330 74616
4619 74616 80011 85615 84476 77476 72305 72184 77424 80193 76393 67493 60423 56883 58315 64202 65819
4604 65819 61036 58597 54411 49562 43307 40432 39036 34338 33198 40124 50237 55368 53382 48850
4590 48850 48322 46232 38551 35000 34856 30132 26907 28105 30772 35291 41341 46194 46942 39515 28995
4575 28995 21575 19462 18780 19240 20320 19526 18363 15339 14362 14259 12464 9581 8915 11017 11305 7986
4559 7986 3339 3767 5246 4681 5884 8951 5701 -1699 -1442 2276 3328 921 464 1177 -998 -310 1810
4541 1947 -1178 -2744 -3239 -3442 -5125 -3412 -2801 -6189 -9663 -8893 -7298 -1556 3364 1690 -2772 -7432
$$ packed form
4649A56479q564p250o079n488o942r231n27K776K499j392l790m266k010k688o733
4634I6794m073J813L38m424p199k965M382M279J247j301n561n543j250k07j714
4619G4616N395N604j139p000n171j21N240K769l800q900p070l540J432N887J617
4604F5819m783k439m186m849o255k875j396m698j140O926J0113N131j986m532
4590D8850n28k090p681l551j44m724l225J198K667M519O050M853P48p427j0520
4575B8995p420k113o82M60J080p94j163l024r77j03j795k883o66K102K88l319
4559G986C339M28J479n65J203L067l250a699K57B276J052I21m57P13i98c10A810
4541A947a178j566m95k03j683J713O11l388l474P70J595a556C364j674b772m660
$$ plain form
4525 -7432 -8718 -9021 -11389 -12216 -10208 -8968 -6705 -2392 538 2330 1307 -9108 -17115 -17458 -14166 -11554
4509 -11554 -13703 -18283 -22884 -26885 -22764 -16171 -14836 -20832 -27736 -31100 -30077 -26268 -22604 -20684 -17093
4494 -17093 -9794 -4115 -4435 -7625 -14135 -21827 -27841 -26262 -22662 -20241 -17060 -17907 -20930 -24295 -28764
4479 -28764 -33292 -35565 -35378 -34595 -36016 -33408 -23136 -11717 -4589 -10064 -21794 -33002 -38658 -40409
4465 -40409 -38186 -35251 -32342 -30967 -35841 -42413 -48580 -49690 -52019 -52909 -50642 -45768 -40362 -35854 -35121
4450 -35121 -35207 -31333 -26317 -15350 -2619 5411 7340 1435 -6643 -8215 567 11056 14027 6570 -6126
4434 -19014 -25442 -27081 -29203 -27915 -19946 -14307 -9751 -8722 -10397 -15447 -17786 -22749 -25886 -22439 -20284
4419 -20284 -25353 -25575 -24680 -27888 -27822 -19289 -8460 -1091 250 -6965 -18282 -27016 -31371 -34915 -37033 -32369
$$ packed form
4525g432j286l03k368q27K008J240K263b392E38J792j023i108q007l43L292K612
4509a1554k149m580m601m001M121O593J335n996o904l364J023L809L664J920L591
4494a7093P299d115l20l190o510p692o014J579L600K421L181q47l023l365m469
4479b8764m528k273J87P83j421K608J0272J1419d589n475j1730j1208n656j751
4465d0409K223K935K909J375m874o572o167j110k329q90K267M874N406M508P33
4450c5121q6L874N016J0967b619E411J929A435f643j572E67J0489K971F570f126
4434a9014o428j639k122J288P969N639M556J029j675n050k339m963l137L447K155
4419b0284n069k22Q95l208O6Q533h460a091B50f965j1317q734m355l544k118M664
$$ plain form
4403 -32369 -20582 -10532 -9678 -14721 -20480 -22725 -19053 -18637 -22435 -24762 -27588 -29840 -29146 -29574 -26676
4388 -26676 -23491 -28949 -39138 -45297 -46638 -44387 -43328 -43488 -42100 -38011 -37082 -40475 -41167 -42365 -43802
4373 -43802 -43526 -42294 -41622 -42791 -42818 -39618 -38486 -40900 -45968 -49067 -49321 -48693 -48428 -47630 -43890 -39057 -39709
4356 -39709 -43110 -46821 -49110 -51355 -53419 -51202 -51459 -53131 -50993 -47479 -45798 -50121 -52699 -49564 -49345
4341 -49345 -52450 -51657 -50023 -48202 -48956 -49462 -46482 -42805 -43243 -43125 -41241 -39444 -37456 -35714 -33787 -30810
4325 -30810 -29202 -29821 -28443 -24410 -24551 -28745 -33209 -38584 -41773 -45874 -49483 -52485 -51577 -48649 -47616
4310 -47616 -51263 -59449 -65019 -66081 -63330 -57957 -57207 -60658 -66936 -68573 -64627 -60450 -58784 -57357 -53806
4295 -53806 -53200 -56133 -58154 -62104 -69714 -76062 -76815 -74188 -70798 -66293 -63638 -64839 -67302 -69286 -69525
$$ packed form
4403c2369J1787J0050Q54n043n759k245L672M16l798k327k826k252O94m28K898
4388b6676L185n458j0189o159j341K251J059j60J388M089R29l393o92j198j437
4373d3802K76J232O72j169k7L200J132k414n068l099k54O28K65P98L740M833o52
4356c9709l401l711k289k245k064K217k57j672K138L514J681m323k578L135K19
4341d9345l105P93J634J821p54n06K980L677m38J18J884J797J988J742J927K977
4325c0810J608o19J378M033j41m194m464n375l189m101l609l002R08K928J033
4310d7616l647q186n570j062K751N373P50l451o278j637L946M177J666J427L551
4295e3806O06k933k021l950p610o348p53K627L390M505K655j201k463j984k39
$$ plain form
4280 -69525 -68873 -69995 -70934 -69334 -68356 -65342 -63538 -61509 -63641 -70104 -73144 -71053 -65692 -61724 -60806 -59394
4264 -59394 -58747 -54903 -49938 -50253 -53628 -55360 -52542 -50882 -50476 -56353 -59317 -56805 -57759 -62529 -61896 -56734
4248 -56734 -58360 -65365 -69724 -72899 -69974 -65523 -64250 -61705 -60897 -63579 -64324 -62599 -62457 -60464 -58713
4233 -58713 -55607 -50999 -48260 -49608 -49696 -47119 -48395 -52391 -52582 -56629 -57446 -51145 -47372 -45736 -46154 -48952
4217 -48952 -48323 -45708 -46142 -51169 -57208 -56965 -56802 -55301 -58856 -65497 -68423 -69019 -69480 -68088 -72657 -78090
4201 -78090 -79619 -78637 -75320 -72868 -72149 -69973 -73886 -81682 -79012 -73368 -71483 -68010 -66912 -70229 -76092
4186 -76092 -81771 -81260 -75603 -74517 -77335 -83063 -85866 -85570 -87297 -84697 -76757 -70460 -70132 -74602 -83695
4171 -83695 -90100 -87070 -82160 -81173 -82998 -82469 -81872 -78835 -73164 -66887 -63975 -65031 -66225 -64545 -58430
$$ packed form
4280f9525O52j122r39J600R78L014J804K029k132o463l040K091N361L968R18J412
4264e9394O47L844M965l15l375j732K818J660M06n877k964K512r54m770O33N162
4248e6734j626p005m359l175K925M451J273K545Q08k682p45J725J42J993J751
4233e8713L106M608K739j348q8K577j276l996j91m047q17O301L773J636m18k798
4217d8952O29K615m34n027o039K43J63J501l555o641k926n96m61J392m569n433
4201g8090j529R82L317K452P19K176l913p796K670N644J885L473J098l317n863
4186g6092n679N11N657J086k818n728k803K96j727K600P940O297L28m470r093
4171h3695o405L030M910R87j825N29N97L037N671O277K912j056j194J680O115
$$ plain form
4156 -58430 -53654 -52833 -52913 -54959 -57651 -55320 -51395 -45797 -38822 -37280 -41588 -39614 -36221 -30574 -23796
4141 -23796 -20000 -18959 -19332 -18422 -20488 -19677 -13616 -4787 3808 8350 9602 9502 10703 15628 21703 24838
4125 24838 29509 36277 42533 48706 52112 53043 55762 57382 61551 69954 74927 71816 66852 64169 61152
4110 61152 60678 60115 55584 51388 46485 42165 41474 43793 46348 47153 44290 36486 28651 24360 22621 18430
4094 18430 8024 136 550 2107 2247 -20 -6655 -10984 -11694 -10638 -6275 -7318 -15119 -21071 -21383 -19074
4078 -19074 -21333 -23181 -19570 -16639 -14571 -13572 -17319 -21797 -21786 -18057 -6350 6875 11189 9917 5649
4063 5649 6864 14180 21741 27432 29424 33638 41577 52267 60450 65716 72070 84151 99720 109345
4049 109345 114098 117818 122316 130528 142347 149820 155128 163644 173381 185490 197299 205398 216020
$$ packed form
4156e8430M776Q21q0k046k692K331L925N598O975J542m308J974L393N647O778
4141b3796L796J041l73R10k066Q11O061d787C808M542J252j00J201M925O075L135
4125B4838M671O768O256O173L406R31K719J620M169Q403M973l111m964k683l017
4110F1152m74n63m531m196m903m320o91K319K555Q05k863p804p835m291j739m191
4094A8430H024A36M14J557J40b0o635m329p10J056M363j043p801n952l12K309
4078a9074k259j848L611K931K068R99l747m478J1L729f350F875M314j272m268
4063E649J215P316P561N691J992M214P939J0690Q183N266O354J2081J5569R625
4049A09345M753L720M498Q212J1819P473N308Q516R737J2109J1809Q099J0622
$$ plain form
4036 216020 228380 239855 249881 264526 276054 283276 292090 301882 310466 315693 322177 326714 328361
4023 328361 330909 334821 340277 347993 348423 344644 345424 348490 350851 347248 341490 338800 333692 329197 327039
4008 327039 324318 319870 317491 314026 311894 308138 301118 291539 283173 275799 271157 268467 264807 262832
3994 262832 258973 258715 261677 262319 264661 272490 281913 289198 296444 306296 312736 315883 320176 327010 335655
3979 335655 342920 348006 350455 351865 355749 365386 373916 378641 385304 392817 401594 409361 415900 419726
3965 419726 424659 430728 428097 415691 404333 396036 384003 366644 348576 335676 329661 326462 322092
3952 322092 312660 304822 300352 294346 285486 274587 266220 257097 246010 233011 218100 207738 204307
3939 204307 199405 191815 184487 177114 171050 167927 164340 158108 157311 157841 156640 157054 155749 161614 170757
$$ packed form
4036B16020J2360J1475J0026J4645J1528P222Q814R792Q584N227O484M537J647
4023C28361K548L912N456P716M30l779P80L066K361l603n758k690n108m495k158
4008C27039k721m448k379l465k132l756p020r579q366p374m642k690l660j975
3994B62832l859k58K962O42K342P829R423P285P246R852O440L147M293O834Q645
3979C35655P265N086K449J410L884R637Q530M725O663P513Q777P767O539L826
3965D19726M933O069k631j2406j1358q297j2033j7359j8068j2900o015l199m370
3952C22092r432p838m470o006q860j0899q367r123j1087j2999j4911j0362l431
3939B04307m902p590p328p373o064l123l587o232p97N30j201M14j305N865R143
$$ plain form
3924 170757 177665 187236 191682 188318 187369 190689 199284 206284 212540 222024 233362 246275 256537 268823
3910 268823 286727 307761 322790 332280 340908 349545 355778 353479 348989 350038 360031 372862 382417
3897 382417 387988 398228 411061 420833 431746 445418 457224 468780 481567 491891 502051 512514
3885 512514 525061 542455 565790 587836 605988 625648 646788 664187 687376 715794 741130 765550
3873 765550 788451 818005 852921 891097 930813 969336 1010508 1049336 1087074 1131019 1179386 1228349
3861 1228349 1279547 1337627 1404232 1474281 1545181 1623586 1707914 1795654 1889180 1982045 2071826
3850 2071826 2163421 2262945 2372049 2492142 2625528 2771055 2932407 3115002 3317108 3539345
3840 3539345 3776970 4034310 4306462 4596198 4903394 5224593 5563930 5931684 6333138 6777007
$$ packed form
3924A70757O908R571M446l364r49L320Q595P000O256R484J1338J2913J0262J2286
3910B68823J7904K1034J5029R490Q628Q637O233k299m490J049R993J2831R555
3897C82417N571J0240J2833R772J0913J3672J1806J1556J2787J0324J0160J0463
3885E12514J2547J7394K3335K2046J8152J9660K1140J7399K3189K8418K5336K4420
3873G65550K2901K9554L4916L8176L9716L8523M1172L8828L7738M3945M8367M8963
3861A228349N1198N8080O6605P0049P0900P8405Q4328Q7740R3526R2865Q9781
3850B071826R1595R9524J09104J20093J33386J45527J61352J82595K02106K22237
3840C539345K37625K57340K72152K89736L07196L21199L39337L67754M01454M43869
$$ plain form
3830 6777007 7273033 7828062 8449892 9154328 9957418 10885284 11940530 13080763 14290305
3821 14290305 15655983 17269408 19192540 21503582 24289252 27649116 31716354 36633067
3813 36633067 42543540 49575044 57799906 67193392 77611366 88801510 100437256 112182668
3805 112182668 123766625 135047854 146046077 156936390 168009339 179598776 192060252
3798 192060252 205711481 220684196 236803533 253484248 269756969 284458946 296485985
3791 296485985 305070176 309949978 311343243 309761430 305749157 299746429 292057626 282872845
3783 282872845 272341572 260558766 247570382 233484834 218642667 203654901 189168024
3776 189168024 175570506 162924556 151095245 139894463 129169155 118797006 108709863
$$ packed form
3830F777007M96026N55029O21830P04436Q03090R27866J055246J140233J209542
3821A4290305J365678J613425J923132K311042K785670L359864M067238M916713
3813C6633067N910473P031504Q224862R393486J0417974J1190144J1635746J1745412
3805A12182668J1583957J1281229J0998223J0890313J1072949J1589437J2461476
3798A92060252J3651229J4972715J6119337J6680715J6272721J4701977J2027039
3791B96485985Q584191M879802J393265j581813m012273o002728p688803r184781
3783B82872845j0531273j1782806j2988384j4085548j4842167j4987766j4486877
3776A89168024j3597518j2645950j1829311j1200782j0725308j0372149j0087143
$$ plain form
3769 108709863 98882214 89322057 80071519 71198059 62813812 55057270 48054709 41904518
3761 41904518 36626791 32163130 28421830 25295534 22674078 20461152 18572978 16943332
3753 16943332 15514531 14253513 13140385 12156062 11278207 10489496 9778785 9137461 8559228
3744 8559228 8034041 7555855 7118658 6716777 6342608 5995952 5678935 5378699 5095278 4835236
3734 4835236 4597272 4380581 4180615 3996360 3827222 3674573 3530131 3392406 3267556 3147606
3724 3147606 3031008 2922443 2817818 2720331 2631570 2542615 2458517 2378765 2300482 2224020 2148406
3713 2148406 2077491 2015129 1958653 1903276 1845209 1791373 1743817 1698463 1651188 1602459 1554868
3702 1554868 1509791 1465978 1431376 1398111 1363643 1326949 1291235 1258751 1226778 1197503 1169937
$$ packed form
3769A08709863r827649r560157r250538q873460q384247p756542p002561o150191
3761D1904518n277727m463661l741300l126296k621456k212926j888174j629646
3753A6943332j428801j261018j113128r84323q77855p88711p10711o41324n78233
3744H559228n25187m78186m37197m01881l74169l46656l17017l00236k83421k60042
3734D835236k37964k16691j99966j84255j69138j52649j44442j37725j24850j19950
3724C147606j16598j08565j04625r7487q8761q8955q4098p9752p8283p6462p5614
3713B148406p0915o2362n6476n5377n8067n3836m7556m5354m7275m8729m7591
3702A554868m5077m3813l4602l3265l4468l6694l5714l2484l1973k9275k7566
$$ plain form
3691 1169937 1145265 1123122 1102588 1084887 1065740 1041817 1020602 1003137 981367 955324 930038
3680 930038 906471 890163 877885 864089 850169 837316 823104 813637 798569 777422 763448 759137
3668 759137 755219 743979 729178 716024 705981 697696 687465 674929 665285 657831 650015 642968 634951
3655 634951 621857 607380 594681 585364 575912 564400 552226 543143 536273 533506 530011 522262 510935
3642 510935 501189 493855 486825 480930 477496 474828 470029 464793 456423 449888 443850 436787 433148 427937
3628 427937 424971 425594 422411 412887 402471 393943 385529 379567 376449 374615 371741 367198 361207 355715
3614 355715 350834 344616 336791 330452 322117 317282 314107 312317 311759 313835 321153 325822 322375 314212 302663
3599 302663 294765 287116 287307 291685 291423 286932 279887 276149 277012 274510 267952 265604 270226 270585 266337
$$ packed form
3691A169937k4672k2143k0534j7701j9147k3923k1215j7465k1770k6043k5286
3680I30038k3567j6308j2278j3796j3920j2853j4212r467j5068k1147j3974m311
3668G59137l918j1240j4801j3154j0043q285j0231j2536r644p454p816p047q017
3655F34951j3094j4477j2699r317r452j1512j2174r083o870k767l495p749j1327
3642E10935r746p334p030n895l434k668m799n236q370o535o038p063l639n211
3628D27937k966O23l183r524j0416q528q414n962l118j834k874m543n991n492
3614C55715m881o218p825o339q335m835l175j790n58K076P318M669l447q163j1549
3599C02663p898p649J91M378k62m491p045l738Q63k502o558k348M622L59m248
$$ plain form
3584 266337 262486 258974 253046 245887 239209 236527 239403 239472 244541 255467 262778 258801 250532 237226
3570 237226 229974 227996 225218 220614 215078 210432 209146 209547 211118 213597 215238 217306 213247 203005
3556 203005 195818 192777 192167 190907 187628 185990 183515 180626 185702 194533 195815 192305 191162 192444 192182
3541 192182 193758 193282 186335 179085 173682 174152 175876 174248 168243 160964 161965 166945 167828 164838 158368
3526 158368 151439 152273 151891 148401 143779 139553 137897 135741 132964 133043 133656 132574 131201 128907 126028 124458
3510 124458 123887 124888 121174 119160 119013 115008 109029 107140 108759 110664 112146 111677 106838 102639 102144
3495 102144 104716 106511 107072 104443 99843 95405 94055 90879 91431 92978 91689 88296 89025 92052 92377
3480 92377 90733 88218 83402 79030 77338 78571 77886 70981 63932 63574 67613 65585 65319 67775 69208
$$ packed form
3584B66337l851l512n928p159o678k682K876O9N069J0926P311l977q269j3306
3570B37226p252j978k778m604n536m646j286M01J571K479J641K068m059j0242
3556B03005p187l041o10j260l279j638k475k889N076Q831J282l510j143J282k62
3541A92182J576m76o947p250n403M70J724j628o005p279J001M980Q83k990o470
3526A58368o929Q34l82l490m622m226j656k156k777P9O13j082j373k294k879j570
3510A24458n71J001l714k014j47m005n979j889J619J905J482m69m839m199m95
3495A02144K572J795N61k629m600m438j350l176N52J547j289l393P29L027L25
3480I2377j644k515m816m372j692J233o85o905p049l58M039k028k66K456J433
$$ plain form
3465 69208 71415 75919 77757 74455 66353 61955 64005 66866 66175 61573 60767 67200 73951 72782 70587
3450 70587 68487 65554 64169 64204 58512 52334 49781 48653 51392 52871 51322 52735 54489 55836 57439
3435 57439 55276 56094 58347 56498 56073 59538 59939 57665 52572 46033 37860 35043 36923 37986 38264 36494
3419 36494 32543 33821 37792 38381 33449 28556 28436 33251 37393 39080 38873 38597 38092 33324 26122 19306
3403 19306 16251 16634 19498 18534 14335 15691 22759 25984 25447 25556 24858 21227 19605 18752 18783 17201 16470
3386 16470 21882 28550 31576 31872 26103 21336 20458 21467 22406 18460 14007 12784 16050 22737 28702
3371 28702 30129 26823 22525 22218 22598 19055 17305 19744 26283 32880 42380 51922 55017 54772 55885
3356 55885 53684 41180 29435 22535 20829 19793 11911 10774 15125 16850 18291 19451 23551 30076
$$ packed form
3465F9208K207M504J838l302q102m398K050K861o91m602q06O433O751j169k195
3450G0587k100k933j385L5n692o178k553j128K739J479j549J413J754J347J603
3435E7439k163Q18K253j849m25L465M01k274n093o539q173k817J880J063K78j770
3419C6494l951J278L971N89m932m893j20M815M142J687k07k76n05m768p202o816
3403A9306l055L83K864r64m199J356P068L225n37J09o98l631j622q53L1j582p31
3386A6470N412O668L026K96n769m767q78J009R39l946m453j223L266O687N965
3371B8702J427l306m298l07L80l543j750K439O539O597R500R542L095k45J113
3356E5885k201j2504j1745o900j706j036p882j137M351J725J441J160M100O525
$$ plain form
3342 30076 35100 42583 60866 90782 124422 156392 211730 318789 491137 691249 892937
3331 892937 994754 971278 796912 574207 376771 240579 159458 111670 89831 77447 64620
3320 64620 53298 42506 39280 43511 43125 37981 32687 33413 33005 24209 14745 9467 8138 6171 407
3304 -641 903 3573 4259 2935 360 -1207 -1304 -1271 -445 1824 2677 -923 -6932 -12145 -13246 -12604 -10013 -10104
3286 -10104 -11842 -14799 -16660 -13042 -11489 -14233 -14189 -12629 -15919 -22598 -27602 -27129 -27370 -27002 -23324 -21834
3270 -21834 -20684 -14642 -4693 345 8856 18923 24035 14655 -1579 -9819 -14386 -17649 -16014 -11493 -10576
3255 -10576 -14383 -19172 -21748 -17461 -12007 -9828 -8179 -8632 -12638 -18899 -18903 -16868 -14054 -11292 -5433 5076
3238 14640 20001 19793 15834 11287 6430 3662 2316 5276 14767 18518 21217 25107 25009 26112 31595
$$ packed form
3342C0076N024P483J8283K9916L3640L1970N5338J07059J72348K00112K01688
3331H92937J01817k3476j74366k22705j97436j36192q1121m7788k1839j2384j2827
3320F4620j1322j0792l226M231l86n144n294P26m08q796r464n278j329j967D07
3304f41I03K670O86j324C60a207r7L3d45A824Q53i23o009n213j101O42K591r1
3286a0104j738k957j861L618J553k744M4J560l290o679n004M73k41L68L678J490
3270b1834J150O042d693C45Q511J0067N112r380a579q240m567l263J635M521R17
3255a0576l807m789k576M287N454K179J649m53m006o261mK035K814K762e433E076
3238A4640N361k08l959m547m857k768j346K960R491L751K699L890r8J103N483
$$ plain form
3223 31595 34706 35734 34831 36762 42213 43113 40502 43747 47035 54423 70493 86342 97579 107596
3209 107596 118515 134645 161405 205864 238662 219544 196423 188502 196168 214239 230320 233185
3197 233185 245584 270104 285514 298191 309645 317231 332398 359126 392843 422613 451765 492753
3185 492753 552107 617965 681643 742204 814621 931084 1123397 1447435 1959713 2371209 2089663
3174 2089663 1654443 1469834 1447681 1483936 1533550 1612200 1735423 1914000 2124981 2358705
3164 2358705 2650187 3009822 3437617 3966778 4661974 5557083 6710708 8205510 10243481
3155 10243481 13045191 16328258 20601501 27430698 38703239 58680757 97102698 170637678
3147 170637678 262096916 243559800 147398432 85522301 54299356 37457916 27612390
$$ packed form
3223C1595L111J028r03J931N451R00k611L245L288P388J6070J5849J1237J0017
3209A07596J0919J6130K6760M4459L2798j9118k3121p921P666J8071J6081K865
3197B33185J2399K4520J5410J2677J1454P586J5167K6728L3717K9770K9152M0988
3185D92753N9354O5858O3678O0561P2417J16463J92313L24038N12278M11496k81546
3174B089663m35220j84609k2153L6255M9614P8650J23223J78577K10981K33724
3164B358705K91482L59635M27795N29161O95196Q95109J153625J494802K037971
3155A0243481K801710L283067M273243O829197J1272541J9977518L8421941P3534980
3147A70637678R1459238j8537116r6161368o1876131l1222945j6841440r845526
$$ plain form
3140 27612390 21507358 17638089 15105589 12844363 10570731 8858468 7631175 6692951
3132 6692951 5919842 5256255 4721067 4299069 3948246 3646111 3405203 3193208 2970069 2756524
3122 2756524 2601724 2552488 2630006 2869101 3229888 3136644 2509223 2029607 1765938 1607895
3112 1607895 1501438 1413536 1339889 1272482 1212185 1160905 1115151 1084955 1080398 1089486 1073412 1034955
3100 1034955 993296 949423 899081 858597 841487 827532 807838 801466 810630 828128 860693 919238
3088 919238 980356 984241 958045 931700 890473 855250 839209 839084 850401 863253 872362 895865
3076 895865 927499 966243 1014774 1044238 1050205 1064131 1085767 1100890 1130040 1182079 1243084 1303547
3064 1303547 1374496 1452334 1504855 1540302 1584273 1642071 1711506 1793969 1888348 2002422 2135077
$$ packed form
3140B7612390o105032l869269k532500k261226k273632j712263j227293r38224
3132F692951p73109o63587n35188m21998l50823l02135k40908k11995k23139k13545
3122B756524j54800m9236P7518K39095L60787r3244o27421m79616k63669j58043
3112A607895j06457q7902p3647o7407o0297n1280m5754l0196m557R088j6074l8457
3100A034955m1659m3873n0342m0484j7110j3955j9694o372R164J7498L2565N8545
3088I19238O1118L885k6196k6345m1227l5223j6041j25J1317J2852R109K3503
3076H95865L1634L8744M8531K9464N967J3926K1636J5123K9150N2039O1005O0463
3064A303547P0949P7838N2521L5447M3971N7798O9435Q2463R4379J14074J32655
$$ plain form
3053 2135077 2287811 2462355 2645188 2839202 3071044 3294424 3481537 3706638 4004912 4379543
3043 4379543 4824084 5343225 5955019 6677795 7527131 8529645 9708510 11067021 12621185
3034 12621185 14377297 16281339 18276000 20294485 22223204 23932932 25309009 26261346
3026 26261346 26738020 26719184 26236596 25355065 24136959 22635729 20915086 19048663 17120631
3017 17120631 15226258 13447188 11839541 10436719 9231792 8196527 7285352 6490051
3009 6490051 5808627 5230942 4747043 4336358 3992705 3700464 3434368 3176569 2946643 2745097
2999 2745097 2565120 2410537 2268040 2124534 1985089 1854507 1734414 1622239 1515918 1419413
2989 1419413 1335754 1260230 1188480 1121782 1061626 1004024 949461 899666 850990 803204 763104
$$ packed form
3053B135077J52734J74544J82833J94014K31842K23380J87113K25101K98274L74631
3043D379543M44541N19141O11794P22776Q49336J002514J178865J358511J554164
3034A2621185J756112J904042J994661K018485J928719J709728J376077R52337
3026B6261346M76674j8836m82588q81531j218106j501230j720643j866423j928032
3017A7120631j894373j779070j607647j402822j204927j035265r11175p95301
3009F490051o81424n77685m83899m10685l43653k92241k66096k57799k29926k01546
2999B745097j79977j54583j42497j43506j39445j30582j20093j12175j06321r6505
2989A419413q3659p5524p1750o6698o0156n7602n4563m9795m8676m7786m0100
$$ plain form
2978 763104 727492 696348 668875 646771 624821 601233 578133 553964 532466 515062 503311 498769
2966 498769 506557 529539 569935 651032 803537 1006149 1219870 1330292 1301699 1130451 895179
2955 895179 682899 531087 438868 380499 345504 322682 306285 287937 270901 258836 253710
2944 253710 256544 263770 278321 305026 355979 452967 612856 732299 651463 498788 402620
2933 402620 358196 323360 297120 286247 287484 302866 337442 399863 500448 666947 951035
2922 951035 1363896 1748635 1895040 1674769 1247182 883770 658295 531716 465191 434863
2912 434863 431872 453544 519542 652264 873134 1185495 1536555 1959824 2439319 2404619 1927061
2901 1927061 1498621 1121024 820731 627118 509812 439364 402796 396833 426372 502151 643820
$$ packed form
2978G63104l5612l1144k7473k2104k1950k3588k3100k4169k1498j7404j1751m542
2966D98769P788K2982M0396Q1097J52505K02612K13721J10422k8593j71248k35272
2955H95179k12280j51812r2219n8369l4995k2822j6397j8348j7036j2065n126
2944B53710K834P226J4551K6705N0953R6988J59889J19443q0836j52675r6168
2933D02620m4424l4836k6240j0873J237J5382L4576O2421J00585J66499K84088
2922I51035M12861L84739J46405k20271m27587l63412k25475j26579o6525l0328
2912D34863k991K1672O5998J32722K20870L12361L51060M23269M79495l4700m77558
2901A927061m28440l77597l00293j93613j17306p0448l6568n963K9539P5779J41669
$$ plain form
2890 643820 882792 1231591 1576206 1756620 1632329 1244122 838917 572243 418329 328746
2880 328746 270466 228246 204150 196070 205590 234715 272434 317709 401990 529585 567521 436938
2868 436938 298346 220886 188475 180613 176548 166303 149917 130384 121555 130838 154047 184052
2856 184052 213950 217999 191270 163531 147993 151328 167905 189555 223522 264177 295927 309914
2844 309914 310466 310560 331006 374497 421315 440728 420589 386058 353376 330269 319271 325529 347470
2831 347470 383663 432429 477083 511853 529538 536851 561722 611575 681872 740063 782097 854276
2819 854276 939545 919194 835309 818831 876925 973881 1003248 921503 855132 835169 858388 941824
2807 941824 1102803 1337150 1561420 1644748 1640673 1619594 1616988 1643125 1602233 1572887 1615735
$$ packed form
2890F43820K38972L48799L44615J80414j24291l88207m05205k66674j53914q9583
2880C28746n8280m2220k4096q080R520K9125L7719M5275Q4281J27595L7936j30583
2868D36938j38592p7460l2411p862m065j0245j6386j9533q829R283K3209L0005
2856A84052K9898M049k6729k7739j5538L335J6577K1650L3967M0655L1750J3987
2844C09914N52R4K0446M3491M6818J9413k0139l4531l2682k3107j0998O258K1941
2831C47470L6193M8766M4654L4770J7685P313K4871M9853P0297N8191M2034P2179
2819H54276Q5269k0351q3885j6478N8094R6956K9367q1745o6371j9963K3219Q3436
2807I41824J60979K34347K24270Q3328m075k1079k606K6137m0892k9346M2848
$$ plain form
2796 1615735 1584411 1469771 1414296 1445605 1564090 1735289 1925061 2162219 2413124 2669208
2786 2669208 2876948 2854079 2642828 2524162 2572948 2712292 2793288 2775319 2792829 2900365
2776 2900365 3084080 3332069 3684555 4177090 4749857 5394481 6193937 6979005 7518838 7818732
2766 7818732 8192517 8965703 10253931 12189480 15062201 19227516 25291240 35491101
2758 35491101 54132735 84600980 110028759 97884806 71225643 55641831 48225828
2751 48225828 41646961 36856660 35056463 35732861 39157037 45937938 56972642 74521317
2743 74521317 104143828 156301783 235004799 309551438 338627894 298992384 220755652
2736 220755652 154467346 113754591 90549165 78231341 72716192 72398423 77523407 89948882
$$ packed form
2796A615735l1324j14640n5475L1309J18485J71199J89772K37158K50905K56084
2786B669208K07740k2869k11251j18666M8786J39344Q0996j7969J7510J07536
2776B900365J83715K47989L52486M92535N72767O44624P99456P85068N39833K99894
2766G818732L73785P73186J288228J935549K872721M165315O063724J0199861
2758C5491101J8641634L0468245K5427779j2143953k6659163j5583812p416003
2751D8225828o578867m790301j800197O76398L424176O780901J1034704J7548675
2743G4521317K9622511N2157955P8703016P4546639K9076456l9635510p8236732
2736B20755652o6288306m0712755k3205426j2317824n515149l17769N124984J2425475
$$ plain form
2728 89948882 113637918 153506772 211303360 276527933 353905509 447164866 445870015
2721 445870015 355654578 276790824 207964493 151108792 114425749 93339379 81054032
2714 81054032 75219716 75085241 80752886 93966388 118769182 161556471 226654344 292661378
2706 292661378 326374668 303870084 232114218 156044668 106766980 79067923 62973108
2699 62973108 52896325 46177333 42007346 40504150 41964408 46507574 52182430 59089386
2691 59089386 74783845 100331002 108979496 83381019 55595717 38743930 29242825
2684 29242825 23698700 20196665 17504355 15373737 13885032 12924637 12278896 11678534 10945681
2675 10945681 10048005 9164032 8502760 8057585 7721601 7453733 7262252 7143843 7088213 7081478
$$ packed form
2728H9948882K3689036L9868854N7796588O5224573P7377576R3259357j294851
2721D45870015r0215437p8863754o8826331n6855701l6683043k1086370j2285347
2714H1054032n834316j34475N667645J3213502K4802794M2787289O5097873O6007034
2706B92661378L3713290k2504584p1755866p6069550m9277688k7699057j6094815
2699F2973108j0076783o718992m169987j503196J460258M543166N674856O906956
2691E9089386J5694459K5547157Q648494k5598477k7785302j6851787r501105
2684B9242825n544125l502035k692310k130618j488705r60395o45741o00362p32853
2675A0945681q97676q83973o61272m45175l35984k67868j91481j18409n5630o735
$$ plain form
2665 7081478 7047549 6900154 6718052 6575266 6492426 6393456 6158210 5937124 5847523 5869349
2655 5869349 5974490 6151185 6397134 6717708 7116638 7600545 8101821 8409887 8474719 8344345
2645 8344345 7992272 7458142 6934282 6532064 6257265 6087649 6007520 6017133 6116928 6313404
2635 6313404 6610133 7014750 7544561 8167826 8752321 9222550 9506512 9455873 9009456 8276629
2625 8276629 7457873 6718642 6120812 5669085 5349784 5142050 5027997 4990360 5023275 5124818
2615 5124818 5300047 5544759 5834163 6127959 6353135 6403420 6206780 5776488 5223530 4667907
2605 4667907 4172007 3755694 3419495 3159812 2968441 2838163 2746537 2677989 2628890 2604700
2595 2604700 2612421 2643489 2686947 2724064 2739823 2744168 2782684 2918346 3131325 3194947 2919518
$$ packed form
2665G081478l3929j47395j82102j42786q2840r8970k35246k21086q9601K1826
2655E869349J05141J76695K45949L20574L98930M83907N01276L08066O4832j30374
2645H344345l52073n34130n23860m02218k74799j69616q0129R613R9795J96476
2635F313404K96729M04617N29811O23265N84495M70229K83962n0639m46417p32827
2625H276629q18756p39231n97830m51727l19301k07734j14053l7637L2915J01543
2615E124818J75229K44712K89404K93796K25176N0285j96640m30292n52958n55623
2605D667907m95900m16313l36199k59683j91371j30278r1626o8548m9099k4190
2595B604700P721L1068M3458L7117J5759M345L8516J35662K12979O3622k75429
$$ plain form
2584 2919518 2541480 2298898 2226674 2314169 2536834 2761229 2843069 2790474 2702989 2623508 2630086
2573 2630086 2780754 3166268 3887151 4717385 5053102 4462072 3561289 2948614 2652056 2537948
2563 2537948 2531058 2606431 2706482 2785176 2737130 2586733 2556453 2807269 3240454 3628636 3785191
2552 3785191 3566364 2977608 2347544 1891801 1620852 1472429 1394300 1361277 1374155 1448694
2542 1448694 1611412 1887730 2237009 2614365 3106348 3290177 2879696 2424723 2050807 1707451
2532 1707451 1444476 1277619 1182310 1133527 1121206 1140969 1205036 1326430 1523221 1834334
2522 1834334 2206134 2443232 2401305 2064544 1627112 1299974 1106326 995412 932408 896342
2512 896342 876420 868232 872377 884925 902355 925768 984110 1103082 1195932 1106637 943174 824010
$$ packed form
2584B919518l78038k42582p2224Q7495K22665K24395Q1840n2595q7485p9481O578
2573B630086J50668L85514P20883Q30234L35717n91030r00783o12675k96558j14108
2563B537948o890P5373J00051P8694m8046j50397l0280K50816M33185L88182J56555
2552C785191k18827n88756o30064m55743k70949j48423p8129l3023J2878P4539
2542A448694J62718K76318L49279L77356M91983J83829m10481m54973l73916l43356
2532A707451k62975j66857r5309m8783j2321J9763O4067J21394J96791L11113
2522A834334L71800K37098m1927l36761m37432l27138j93648j10914o3004l6066
2512H96342j9922q188M145J2548J7430K3413N8342J18972R2850q9295j63463j19164
$$ plain form
2500 824010 761129 729110 711684 694403 674433 650948 624825 603645 589044 586606 586624 591642 604577
2487 604577 608451 590849 569939 556265 552443 556323 556811 548795 533921 522866 519526 514408 508126
2474 508126 501733 494672 495861 501569 503451 500372 500131 499836 502268 505418 497296 489255 489012 490945 494854
2459 494854 499080 498536 492090 482866 478534 481626 483432 482378 479345 475150 472700 471811 472484 478188 489360
2444 489360 501591 508590 507316 502178 495442 489062 482847 480663 478399 474090 471952 471436 470536 467473 465355
2429 465355 463461 458516 448861 443422 444091 440308 431798 421388 409419 402011 397462 389962 383261 379052
2415 379052 378792 380621 383608 384980 386340 389241 386709 383979 385164 388061 387607 387964 384193 372971 363854
2400 363854 358937 356468 354664 355328 356090 352988 351816 355455 362226 371095 368038 361381 361193 362651 363090
$$ packed form
2500H24010o2881l2019j7426j7281j9970k3485k6123k1180j4601k438J8N018J2935
2487F04577L874j7602k0910j3674l822L880M88q016j4874j1055l340n118o282
2474E08126o393p061J189N708J882l079k41k95K432L150q122q041k43J933L909
2459D94854M226n44o446r224m332L092J806j054l033m195k450q89O73N704J1172
2444D89360J2231O999j274n138o736o380o215k184k264m309k138n16r00l063k118
2429D65355j894m945r655n439O69l783q510j0410j1969p408m549p500o701m209
2415C79052k60J829K987J372J360K901k532k730J185K897m54L57l771j1222r117
2400C63854m917k469j804O64P62l102j172L639O771Q869l057o657j88J458M39
$$ plain form
2385 363090 361149 358997 356593 351883 342741 333859 324841 314556 302173 296313 299902 307163 315104 318940
2371 318940 317136 315280 314626 318870 321900 319876 319018 314991 311764 308359 307918 310468 307723 303746 293795
2356 293795 281978 274921 272254 266556 262500 261787 264258 268183 274840 283112 293051 301452 302205 300626 292764
2341 292764 282429 278689 279391 280698 277725 267809 259564 254442 251630 250150 247936 244588 240378 237673
2327 237673 238408 238145 232954 234468 242901 248513 247907 243172 241929 239030 231227 227004 227978 226807 222509
2312 222509 221204 222172 220620 214379 209274 207508 207993 209186 214705 218270 217515 214683 213449 209123 211761
2297 211761 221120 224985 219704 208426 197443 193140 193406 195187 193271 192023 190042 189996 190771 194150 195130
2282 195130 193512 194979 198052 205603 211168 217026 221104 217786 212095 207526 204567 203894 200167 196639 197558
$$ packed form
2385C63090j941k152k404m710r142q882r018j0285j2383n860L589P261P941L836
2371C18940j804j856o54M244L030k024q58m027l227l405m41K550k745l977r951
2356B93795j1817p057k667n698m056p13K471L925O657Q272R939Q401P53j579p862
2341B92764j0335l740P02J307k973r916q245n122k812j480k214l348m210k705
2327B37673P35k63n191J514Q433N612o06m735j243k899p803m223R74j171m298
2312B22509j305R68j552o241n105j766M85J193N519L565p55k832j234m326K638
2297B11761R359L865n281j1278j0983m303K66J781j916j248j981m6P75L379R80
2282A95130j618J467L073P551N565N858M078l318n691m569k959o73l727l528R19
$$ plain form
2267 197558 198198 193022 183617 174911 166786 163631 163986 165252 168879 172225 172936 174049 175921 176586 178040
2252 178040 179947 182933 186056 189866 192167 194149 200120 208636 215036 215403 216550 221222 226957 236409 250938
2237 250938 264290 271242 285045 317360 352632 369075 386296 421000 443131 440003 463357 518459
2225 518459 547634 533125 540409 571540 562334 518223 504251 497971 450444 398019 374346 368096
2213 368096 358707 344184 329024 312465 295318 290675 299660 312177 332191 366775 413813 460195
2201 460195 496888 527305 548798 574326 591170 576578 552408 536816 522205 510732 536508 583986
2189 583986 597617 579610 580525 599980 584743 562706 579161 616266 633181 640681 652391 651147
2177 651147 640194 651843 657276 621993 558299 488607 432055 401153 395202 396999 387142 356051
$$ packed form
2267A97558O40n176r405q706q125l155L55J266L627L346P11J113J872O65J454
2252A78040J907K986L123L810K301J982N971Q516O400L67J147M672N735R452J4529
2237B50938J3352O952J3803L2315L5272J6443J7221L4704K2131l128K3354N5102
2225E18459K9175j4509P284L1131r206m4111j3972o280m7527n2425k3673o250
2213C68096r389j4523j5160j6559j7147m643Q985J2517K0014L4584M7038M6382
2201D60195L6693L0417K1493K5528J6844j4592k4170j5592j4611j1473K5776M7478
2189E83986J3631j8007R15J9455j5237k2037J6455L7105J6915P500J1710j244
2177F51147j0953J1649N433l5283o3694o9692n6552l0902n951J797r857l1091
$$ plain form
2165 356051 322042 304913 301356 305855 320538 341199 362058 374636 391206 427446 469174 488515
2153 488515 479787 465030 438670 397864 364869 342507 326972 315928 301874 283896 269390 263922
2141 263922 266063 269677 273480 285968 317054 365906 419800 426230 390846 365517 357600 355036 350228
2128 350228 340594 326152 312770 299713 290568 284184 292120 318351 348603 341314 307287 287449 280253
2115 280253 281613 286995 290019 291134 285528 279018 280522 289613 296693 304135 315620 332306 349694 366287
2101 366287 376687 379156 379692 377101 370773 368706 371016 367723 362649 358069 348610 346732 357896 370121
2087 370121 379829 385355 384653 383340 386416 397177 415047 436066 464050 498754 541075 582587 613009
2074 613009 646772 697982 757408 794817 793144 770501 739625 696440 636300 562119 489773 438180
$$ packed form
2165C56051l4009j7129l557M499J4683K0661K0859J2578J6570L6240M1728J9341
2153D88515q728j4757k6360m0806l2995k2362j5535j1044j4054j7978j4506n468
2141B63922K141L614L803J2488L1086M8852N3894O430l5384k5329p917k564m808
2128C50228r634j4442j3382j3057r145o384P936K6231L0252p289l4027j9838p196
2115B80253J360N382L024J115n606o510J504R091P080P442J1485J6686J7388J6593
2101C66287J0400K469N36k591o328k067K310l293n074m580r459j878J1164J2225
2087C70121R708N526p02j313L076J0761J7870K1019K7984L4704M2321M1512L0422
2074F13009L3763N1210N9426L7409j673k2643l0876m3185o0140p4181p2346n1593
$$ plain form
2062 438180 403745 381286 374951 379344 389581 407055 426623 449328 488940 544573 592937 625613
2050 625613 617922 536096 440153 370756 326129 299163 282039 271205 271124 277894 294380 326884 374607
2037 374607 412458 421627 419487 436574 486604 544225 585248 600324 575301 527664 487709 472080
2025 472080 464471 441290 407406 368084 333758 318892 322607 338945 357720 363575 349033 329934
2013 329934 320135 319882 336853 376321 432586 480169 503899 513472 515219 489150 434856 370146 311485
2000 311485 266549 236096 212758 192986 182128 183397 182890 179129 178800 182989 193848 214484 238143
1987 238143 254462 259169 262115 260154 241605 212282 186679 168980 157388 149928 144090 140809 142873
1974 142873 145546 142209 138794 136891 134037 130319 128765 134995 144404 140837 128151 121242 117782 115830
$$ packed form
2062D38180l4435k2459o335M393J0237J7474J9568K2705L9612N5633M8364L2676
2050F25613p691q1826r5943o9397m4627k6966j7124j0834q1O770J6486L2504M7723
2037C74607L7851R169k140J7087N0030N7621M1023J5076k5023m7637l9955j5629
2025D72080p609k3181l3884l9322l4326j4866L715J6338J8775N855j4542j9099
2013C29934r799k53J6971L9468N6265M7583K3730R573J747k6069n4294o4710n8661
2000C11485m4936l0453k3338j9772j0858J269n07l761l29M189J0859K0636K3659
1987B38143J6319M707K946j961j8549k9323k5603j7699j1592p460n838l281K064
1974A42873K673l337l415j903k854l718j554O230R409l567j2686o909l460j952
$$ plain form
1960 115830 111959 115002 123873 138768 145272 135075 124662 117839 115487 116615 117869 118592 119949 125748
1946 125748 136643 151472 170561 171431 149340 128529 116584 111642 116335 126324 134895 153115 160837
1933 160837 139355 118979 105054 95863 91462 91308 93793 91637 90380 93194 98892 101175 97887 89656
1919 89656 83172 82817 88427 95950 101465 108540 122620 128452 116532 102957 94719 88892 87037 88938
1905 88938 91333 88969 81814 77212 78144 75928 75882 75227 74041 76497 79395 84309 92341 103902 119760
1890 119760 130189 128977 130907 138114 137317 131858 130842 121645 109750 105246 101784 96478 92262 86500
1876 86500 80678 80485 83092 76672 69255 67244 66975 65259 66565 67236 64606 61132 59967 58014 56991
1861 56991 59049 67082 76869 76516 71918 70389 67005 62406 59365 60911 63490 65144 63146 57771 57746
$$ packed form
1960A15830l871L043Q871J4895O504j0197j0413o823k352J128J254P23J357N799
1946A25748J0895J4829J9089Q70k2091k0811j1945m942M693R989Q571J8220P722
1933A60837k1482k0376j3925r191m401j54K485k156j257K814N698K283l288q231
1919H9656o484l55N610P523N515P075J4080N832j1920j3575q238n827j855J901
1905H8938K395k364p155m602R32k216m6o55j186K456K898M914Q032J1561J5858
1890A19760J0429j212J930P207p97n459j016r197j1895m504l462n306m216n762
1876H6500n822j93K607o420p417k011k69j716J306O71k630l474j165j953j023
1861E6991K058Q033R787l53m598j529l384m599l041J546K579J654j998n375k5
$$ plain form
1846 57746 56638 54727 55854 58218 58537 58868 58698 57672 56878 55381 50673 46930 45225 45852 50810 55428
1830 55428 55146 52273 46829 42741 46142 54458 60747 61372 60053 57964 56786 52941 49702 47774 46952
1815 46952 44954 43098 43372 45749 47333 45109 41954 45916 52950 58639 58843 52202 42091 34907 33392
1800 33392 36903 43505 48683 50976 48981 49196 49345 48829 48688 46389 47958 51084 52032 50976 48588 42018
1784 42018 38118 40970 43297 46190 47527 45132 39897 37767 38054 40199 42767 48485 53775 52615 46494
1769 46494 41611 40858 44358 49214 54552 62841 77426 104943 137873 145625 124519 99696 88463
1756 88463 89151 96852 117095 150074 171294 157418 121972 91931 78046 73920 74513 75868 81879
1743 81879 92955 110658 144725 200118 252535 248560 194598 152161 137114 140201 164397 214217
$$ packed form
1846E7746j108j911J127K364L19L31j70j026p94j497m708l743j705O27M958M618
1830E5428k82k873n444m088L401Q316O289O25j319k089j178l845l239j928q22
1815D6952j998j856K74K377J584k224l155L962P034N689K04o641j0111p184j515
1800C3392L511O602N178K293j995K15J49n16j41k299J569L126R48j056k388o570
1784D2018l900K852K327K893J337k395n235k130K87K145K568N718N290j160o121
1769D6494m883p53L500M856N338Q289J4585K7517L2930P752k1106k4823j1233
1756H8463O88P701K0243L2979K1220j3876l5446l0041j3885m126N93J355O011
1743H1879J1076J7703L4067N5393N2417l975n3962m2437j5047L087K4196M9820
$$ plain form
1731 214217 290540 339380 296290 215560 167492 150568 143067 132520 120818 114991 116152 123265
1719 123265 144689 174837 193322 183184 159183 145114 142304 155789 185309 237359 313113 361027
1707 361027 336352 272796 225290 204452 201863 199089 193131 187885 193971 212840 233308 258035 309075
1694 309075 403096 569052 814737 1001614 922983 695044 533692 477665 483873 475022 420120
1683 420120 365268 348716 379524 447084 484730 439957 392992 389378 420731 488194 628124 903192
1671 903192 1357977 1765745 1650726 1161971 782837 583000 488528 453518 438922 418193
1661 418193 396477 404982 449416 455629 389239 333627 314081 313902 336615 393659 502322 685113
1649 685113 893686 967683 865486 719220 572895 439592 352132 308058 285911 261637 227429
$$ packed form
1731B14217P6323M8840m3090q0730m8068j6924p501j0547j1702n827J161P113
1719A23265K1424L0148J8485j0138k4001j4069k810J3485K9520N2050P5754M7914
1707C61027k4675o3556m7506k0838k589k774n958n246O086J8869K0468K4727N1040
1694C09075R4021J65956K45685J86877p8631k27939j61352n6027O208q851n4902
1683D20120n4852j6552L0808O7560L7646m4773m6965l614L1353O7463J39930K75068
1671I03192M54785M07768j15019m88755l79134j99837r4472l5010j4596k0729
1661D18193k1716Q505M4434O213o6390n5612j9546j79K2713N7044J08663J82791
1649F85113K08573P3997j02197j46266j46325j33303q7460m4074k2147k4274l4208
$$ plain form
1638 227429 199351 181847 173901 172329 172510 175666 183945 194423 212642 240422 271318 307963 351587
1625 351587 360763 307164 245468 205569 184108 173269 164426 160227 154478 146384 137935 135660 138790
1612 138790 140692 136440 129936 124806 127590 135314 135817 131707 129669 132662 136895 136609 127415 121541 120555
1597 120555 124320 124573 120804 115279 105826 95361 88082 86898 87408 88298 90184 86511 80488 75226 68705
1582 68705 68038 74413 78341 80832 83376 81728 77121 78521 85192 92814 98130 98022 96026 94682 93256
1567 93256 88211 80664 67334 51973 44486 40729 42021 43044 45197 44783 42204 38776 35438 38681
1553 38681 38650 36878 35792 36128 36084 37770 39949 45566 52818 50379 46410 41962 38104 41064 40067 34162
1537 34162 32463 32177 32914 36177 34716 26076 16649 10796 12318 14985 16113 17172 18837 20037 20619
$$ packed form
1638B27429k8078j7504p946j572J81L156Q279J0478J8219K7780L0896L6645M3624
1625C51587R176n3599o1696l9899k1461j0839q843m199n749q094q449k275L130
1612A38790J902m252o504n130K784P724N03m110k038K993M233k86r194n874r86
1597A20555L765K53l769n525r453j0465p279j184N10Q90J886l673o023n262o521
1582F8705o67O375L928K491K544j648m607J400O671P622N316j08j996j344j426
1567I3256n045p547j3330j5361p487l757J292J023K153m14k579l428l338L243
1553C8681l1j772j086L36m4J686K179N617P252k439l969m448l858K960r97n905
1537C4162j699k86P37L263j461q640r427n853J522K667J128J059J665J200N82
$$ plain form
1522 20619 19771 13618 7911 5771 6240 4706 1315 -532 -2792 -5215 -7953 -10033 -7999 -4607 1361
1506 12376 18394 18189 11773 11556 13322 12226 12991 14507 11764 8760 5867 4364 4230 4866 7365 11408
1490 11408 11980 12073 16115 21194 25683 29356 30108 25944 24009 23920 21732 21381 24556 28488 29063 25144 25048
1473 25048 23977 17998 13094 11364 10911 10762 9972 14468 17214 13231 12516 16199 14392 8713 8376 10807
1457 10807 9517 9519 7474 3244 -523 -2084 -2934 -4367 -8375 -14797 -16712 -14705 -12898 -13930 -15813 -12949
1441 -12949 -10248 -15293 -21441 -19709 -15484 -9003 -2683 3237 4892 3522 -961 -7786 -13421 -14125 -11260
1426 -11260 -8930 -4938 -4732 -8167 -4984 1095 836 1363 -807 -5552 -7219 -7418 -7187 -7997 -6723 -5481
1410 -5481 -8558 -11335 -11902 -11718 -11547 -10306 -4962 -217 1578 -1116 -10015 -14492 -10415 -5313 -728 2388
$$ packed form
1522B0619q48o153n707k140M69j534A315e32k260k423k738k080K034L392A361
1506A2376O018k05o416k17J766j096P65J516k743l004k893j503j34O36K499M043
1490A1408N72R3M042N079M489L673P52m164j935q9k188l51L175L932N75l919r6
1473B5048j071n979m904j730m53j49p90M496K746l983p15L683j807n679l37K431
1457A0807j290Kk045C244e23j561q50j433m008o422j915K007J807j032j883K864
1441a2949K701n045o148J732M225O481b683C237J655j370i61o825n635p04K865
1426a1260K330L992K06l435L183A095k59N27h07m745j667j99K31q10J274J242
1410e481l077k777n67J84J71J241d962b17A578a116q899m477M077N102g28B388
$$ plain form
1393 2566 1681 1274 520 1922 3950 -1607 -5819 -4839 -4629 -6048 -9295 -10591 -10225 -10916 -12136 -12696 -11615
1376 -11615 -6073 1170 1188 -3421 -3514 -993 -4669 -8663 -4545 3078 8006 10038 10197 10149 8681 3775 -1406
1358 -10009 -14357 -12399 -11796 -11910 -11097 -4747 -8 -2674 -4806 -4608 -4129 -6678 -6507 -4547 -4452 -396 2618 1810
1340 1810 9 -4345 -11358 -13962 -11595 -3979 1085 -1895 -5288 -4453 -3222 -6269 -10696 -14480 -12901 -7742
1324 -7742 -2175 1220 -738 -5403 -8776 -8932 -8890 -7957 -1487 4909 6149 5041 947 -2206 -1626 -2145 -4893
1307 -4893 -6509 -6067 -5530 -7101 -8717 -9624 -8333 -7557 -10658 -17084 -18663 -18657 -17983 -15057 -14680 -15297 -16651
1290 -16651 -15563 -15405 -18681 -17700 -14647 -11167 -5667 -690 1975 4838 780 -4918 -3618 -1066 741 1689
1274 1689 4504 6599 7212 7496 8280 6244 4394 1685 -2695 -5920 -6478 -6497 -5353 -7045 -9605 -5622
$$ packed form
1393B566q85m07E20J402K028a607m212R80K10j419l247j296L66o91j220n60J081
1376a1615N542A170J8c421r3i93l676l994M118C078M928K032J59m8j468C775a406
1358a0009m348J958O03j14Q13d747hk666k132J98M79k549J71J960R5c96B618q08
1340A810Id345p013k604K367c979A085a895l393Q35J231l047m427l784J579N159
1324g742b175A220g38m665l373j56M2R33a487D909J240j108I47b206N80n19k748
1307d893j616M42N37j571j616r07J291P76l101o426j579OO74K926L77o17j354
1290a6651J088J58l276R81L053L480N500f90A975K863G80d918J300a066G41R48
1274A689K815K095O13K84P84k036j850A685b695l225n58j9J144j692k560L983
$$ plain form
1258 -5622 -1942 -685 -1699 1830 9172 10853 6674 4167 5242 1788 -2501 -4121 -2245 411 -1429
1242 -5931 -5053 -6141 -8741 -11696 -14651 -16609 -14026 -6600 -2013 -802 1083 1294 -3955 -9055 -7806 -4596
1226 -4596 -1788 -3309 -6499 -9393 -10791 -7949 -6448 -5723 -6177 -3712 1076 1196 -4913 -8604 -8718 -12815
1210 -12815 -15438 -15815 -13919 -9089 -6999 -6090 -10651 -14617 -15523 -16177 -13391 -10151 -11183 -13413 -12099 -6614
1194 -6614 2596 2270 -5211 -7925 -8655 -6960 -1087 5049 11734 10223 439 -5842 -6948 -7453 -5721 -4356
1178 -4356 -4716 -1259 902 -1321 -2793 -5318 -8409 -9222 -7759 -5075 -3427 -5589 -7948 -7880 -7092 -5690
1162 -5690 -6343 -8249 -3074 3540 2780 -3263 -7735 -9452 -5246 -2690 -4384 -8772 -12563 -11674 -13106 -11595
1146 -11595 -8007 -7225 -10457 -15635 -16659 -16413 -13244 -4778 694 1212 -5528 -12449 -11184 -3035 3562 3516
$$ packed form
1258e622a942f85j014A830P342J681m179k507J075A788b501j620J876D11a429
1242e931Q78j088k600k955k955j958K583f600b013h02A083K11c955n100J249L210
1226d596a788j521l190k894j398K842J501P25m54K465A076J20d913l691j14m097
1210a2815k623l77J896M830K090R09m561l966r06o54K786L240j032k230J314N485
1194f614B596l26e211k714p30J695a087E049O685j511D39e842j106n05J732J365
1178d356l60a259I02a321j472k525l091q13J463K684J648k162k359O8P88J402
1162e690o53j906c074C540p60c263m472j717M206K556j694m388l791Q89j432J511
1146a1595L588P82l232n178j024K46L169d778F94N18e528o921J265c035C562m6
$$ plain form
1130 3516 515 -3304 -5574 -5014 -3317 -2080 -1449 -1239 -3519 -5095 -5208 -4669 -6485 -11002 -13719 -11977
1114 -11977 -9255 -9753 -13993 -16820 -13046 -11528 -12828 -12943 -9366 -5904 -7598 -12726 -17449 -16477 -13710
1099 -13710 -13782 -15100 -18689 -19681 -16120 -11629 -6747 -4814 -7936 -8738 -5687 -5379 -6921 -9119 -11006 -14829
1083 -14829 -16676 -11916 -7688 -7726 -5644 -3840 -1563 1266 -1035 -6130 -8554 -9111 -8285 -4105 1546 2706
1067 2706 -29 -1761 -2412 -5455 -10401 -9820 -7944 -6459 -6724 -8558 -7772 -4463 -5455 -7421 -9387 -11392 -11503
1050 -11503 -8341 -5483 -8030 -12810 -12702 -9780 -9775 -7673 -5225 -8687 -12809 -11759 -4584 1788 2633 -1850
1033 -5147 -5814 -7910 -6434 -2360 -1172 -4763 -9082 -10362 -6783 -3455 -2289 419 -690 -4869 -11071 -14500
1017 -14500 -12240 -9716 -10492 -10782 -13312 -15418 -12062 -10453 -13115 -18075 -19093 -16277 -12795 -10587 -6366
$$ packed form
1130C516E15c304k270N60J697J237O31K10k280j576j13N39j816m517k717J742
1114a1977K722m98m240k827L774J518j300j15L577L462j694n128m723R72K767
1099a3710p2j318l589r92L561M491M882J933l122q02L051L08j542k198j887l823
1083a4829j847M760M228l8K082J804a563A266a035n095k424n57Q26d105A546J160
1067B706b9j732o51l043m946N81J876J485k65j834P86L309r92j966j966k005j11
1050a1503L162K858k547m780J08K922NK102K448l462m122J050d584A788Q45a850
1033e147o67k096J476b360a172l591m319j280L579L328J166D19f90m179o202l429
1017a4500K260K524p76k90k530k106L356J609k662m960j018K816L482K208M221
$$ plain form
1002 -6366 -2145 100 2502 5035 7769 10063 13081 15589 14680 10719 6142 2558 1041 663 2990 5307
986 5307 4077 130 -7389 -12050 -10091 -11430 -16662 -21754 -22011 -19587 -22104 -23021 -17561 -12880 -8430 -8150
970 -8150 -12606 -16782 -17443 -14233 -10843 -11006 -10931 -10639 -11994 -11126 -9567 -11788 -10703 -11123 -9891 -9078 -10040
953 -10040 -8172 -7471 -6540 -4908 -4964 -7930 -9185 -11705 -15745 -16604 -14162 -17619 -23901 -25394 -23755 -21382
937 -21382 -15550 -10277 -13453 -17045 -12682 -10331 -12733 -14559 -12779 -15758 -16506 -10597 -8012 -14631 -24432
922 -24432 -27537 -22033 -16888 -13901 -14063 -12289 -11423 -10283 -6281 -3325 -5592 -7912 -8649 -8665 -7248 -6712
906 -6712 -10500 -11929 -12290 -11776 -11359 -11639 -13302 -15142 -15153 -12220 -9239 -11039 -18263 -23565 -27627 -27619 -24774
889 -24774 -24519 -23826 -22968 -24778 -22662 -15165 -10470 -10727 -11999 -12555 -10202 -6911 -8260 -15170 -19057 -19215
$$ packed form
1002f366b145A00K402K533K734K294L018K508r09l961m577B558A041l78K327K317
986E307j230A30g389m661J959j339n232n092k57K424k517r17N460M681M450K80
970h150m456m176o61L210L390j63P5K92j355Q68J559k221J085m20J232Q13r62
953a0040J868P01R31J632n6k966j255k520m040q59K442l457o282j493J639K373
937b1382N832N273l176l592M363K351k402j826J780k979p48N909K585o619r801
922b4432l105N504N145K987j62J774Q66J140M002K956k267k320p37j6J417N36
906f712l788j429l61N14M17k80j663j840j1K933K981j800p224n302m062QK845
889b4774K55O93Q58j810K116P497M695k57j272n56K353L291j349o910l887j58
$$ plain form
873 -19215 -13568 -12553 -11637 -7629 -2716 249 33 -2147 -4839 -7740 -9303 -8598 -9456 -13862 -14421 -9509 -3381
855 -985 -4185 -7690 -6384 -4775 -5732 -14007 -17747 -13022 -7629 -5571 -4843 138 2950 940 -4279 -6666
839 -6666 -4570 -6855 -13740 -16619 -15818 -16598 -15989 -13673 -11541 -9625 -9134 -8299 -4519 -1132 1904 3854
823 3854 1814 -4746 -10729 -14352 -17399 -19459 -19121 -20132 -19272 -14892 -13147 -17948 -19178 -19373 -18313 -14651
807 -14651 -13314 -12371 -7617 -3414 -5687 -7918 -6583 -1676 -18 -2411 -6385 -10612 -8298 -2725 -1354 -4635
791 -4635 -10132 -15505 -17280 -12144 -6992 -8320 -11245 -14930 -16341 -17281 -17563 -16462 -13735 -8551 -6351 -5863
775 -5863 -7102 -10025 -10434 -7811 -6335 -9027 -8699 -7688 -6121 -415 7197 8256 6890 8605 8222 2894
758 -821 -5656 -10410 -12788 -10770 -7872 -8063 -6997 -5399 -6822 -9104 -9040 -7253 -2751 2545 4044 5101
$$ packed form
873a9215N647J015R16M008b716B49C3b147k692k901j563P05q58m406n59M912c381
855i85l200l505J306J609r57q275l740M725N393K058P28A38K812I40d279k387
839f666K096k285o885k879Q01p80O09K316K132J916M91Q35L780a132A904J950
823C854A814d746n983l623l047k060L38j011Q60M380J745m801j230j95J060L662
807a4651J337R43M754c414k273k231J335a676a8k393l974m227K314b725a354l281
791d635n497n373j775N136N152j328k925l685j411r40k82J101K727N184K200M88
775e863j239k923m09K623J476k692L28J011J567d15G197J059j366J715l83B894
758h21m835m754k378K018K898j91J066J598j423k282O4J787b751B545J499J057
$$ plain form
742 5101 6327 1094 -2858 -4669 -9834 -13140 -9948 -3753 -819 1558 5426 6427 1220 -2733 1280
726 3447 2208 -1255 -4453 -7334 -8231 -10886 -13964 -14400 -15287 -15544 -9004 -2487 391 1202 -1185 -2776 -2194
709 -2194 -64 -2367 -2372 -2862 -588 4865 8787 11301 13993 11482 7697 3491 -158 -2162 -5119 -8191 -10283
692 -10283 -10155 -7613 69 1697 -4876 -6710 -3401 -2396 -5758 -10839 -10248 -1627 2856 -1182 -1843 2024
675 2947 6508 9871 5173 -950 -2112 -3468 -6097 -3842 360 713 330 -5383 -13052 -20214 -20346 -12960
659 -12960 -6585 -5247 -5660 -5441 -5031 -4428 -6451 -5919 -1652 -3670 -9131 -9054 -4920 -6941 -8816 -5511 406
641 5170 5841 405 920 7854 9510 6765 -592 -9406 -15092 -15889 -10568 -7120 -4785 -3231 -1990 -795 1
623 -1463 -5007 -8894 -9004 -8885 -9182 -9495 -9145 -4772 -2051 597 4097 4211 1770 2979 -483 -2820 -1172
$$ packed form
742E101J226A094b858j811n165l306L192c753h19A558L868J001A220b733A280
726C447j239a255l198k881q97k655l078m36q87k57O540b487C91Q11a185j591N82
709b194f4k303nm90e88D865L922K514K692k511l785C491a58k004k957l072k092
692a0283J28K542F9J628d876j834L309J005l362n081N91a627B856a182o61B024
675B947L561L363m698i50j162j356k629K255C60L53C30e383p669p162j32P386
659a2960O375J338m13K19M10O03k023N32a652k018n461P7M134k021j875L305D06
641E170O71D05N15O934J656k745e92q814n686p97N321L448K335J554J241g95A
623a463l544l887j10J19k97l13L50M373b051E97L500J14A770J209d83k337a172
$$ plain form
605 -3946 -9333 -6417 841 9881 17664 20808 24648 27569 17735 7134 4008 2085 1753 2560 5195 4685
589 4685 5061 7980 8015 9699 8442 8536 10708 11404 12963 13305 10894 10418 11737 6743 4301 5806 7737
572 7737 9477 8830 7616 9837 13209 14116 13436 12330 7688 8591 13177 13418 11064 6344 2881 2047 1806
555 1806 1504 818 2644 3621 -594 -3833 -4133 -706 2808 4793 7805 9499 8128 6704 7034 7181 6224
538 6224 4452 3240 3848 6277 3697 3881 9654 14032 13495 9250 6790 7305 5394 -1121 1071 7279
522 7279 7247 1364 1479 8622 7602 237 752 2134 413 2363 5456 4807 3377 1965 347 -885 595 2062
504 2062 2167 1010 -1229 -2371 -2640 -5411 -806 7828 12803 10143 7428 8742 8474 5458 4973 5627 8023
487 8023 11307 9767 5805 4831 8022 10182 11137 7853 2597 1479 3846 7209 9084 6780 7612 8959
$$ packed form
605c946n387K916H41R040P783L144L840K921r834G134l126j923l32Q07K635n10
589D685L76K919L5J684j257R4K172O96J559L42k411m76J319m994k442J505J931
572G737J740o47j214K221L372R07o80j106m642R03M586K41k354m720B881q34k41
555A806l02o86J826R77e94l239l00g06B808J985L012J694j371j424L30J47r57
538F224j772j212O08K429k580J84N773M378n37m245k460N15j911a121A071O208
522G279l2A364J15P143j020B37N15J382D13J950L093o49j430j412C47h85E95J467
504B062J05A010a229j142k69k771h06G828M975k660k715J314k68l016m85O54K396
487H023L284j540l962r74L191K160R55l284B597j118K367L363J875k304Q32J347
$$ plain form
471 8959 8935 7221 1719 -2518 -1640 -702 -3005 -1503 4308 6419 7089 12285 21327 25790 24016 17912
455 17912 14541 15141 14537 13690 10891 8545 9532 9927 4054 2700 8757 12179 9886 9469 8363 7189
439 7189 7473 8504 9262 10536 11075 8238 3241 2323 6254 5226 6898 9870 8443 5818 4709 5522
423 5522 6981 12279 14731 15916 15302 11201 6240 7096 12061 16345 18585 19697 20944 22138 21604 22760
407 22760 26178 29195 28918 25447 20694 18437 17437 14391 14849 18230 18107 13847 8490 4731 -1334 -1260
391 -1260 6864 12328 17264 23261 26420 25150 22237 20884 21078 22560 23652 22053 20393 17917 17625 17026
375 17026 13654 11667 11085 10033 7851 8368 11139 12284 18918 25579 29654 32936 34965 33466 32250
360 32250 29430 19388 11751 13405 14429 15742 14182 11249 13782 19422 19244 12313 8608 5746 2506
$$ packed form
471H959k4j714A719b518Q78g02k303J502D308K111O70N196R042M463j774o104
455A7912l371O00o04q47k799k346R87L95D054j354O057L422k293m17j106j174
439G189K84J031P58J274N39k837C241r18L931j028J672K972j427k625j109Q13
423E522J459N298K452J185o14m101m961Q56M965M284K240J112J247J194n34J156
407B2760L418L017k77l471m753k257j000l046M58L381j23m260n357l759a334P4
391a260F864N464M936N997L159j270k913j353J94J482J092j599j660k476k92n99
375A7026l372j987n82j052k182N17K771J145O634O661M075L282K029j499j216
360C2250k820j0042p637J654J024J313j560k933K533N640j78o931l705k862B506
$$ plain form
344 6034 14287 20074 23193 24726 20225 9937 4405 5248 13535 21536 21457 20235 17811 11773 5953 5996
328 5996 9655 11808 10968 14741 16360 13649 10867 11507 15902 19557 19355 20395 19820 16643 14644 12143
312 12143 11564 12280 14357 19171 20085 16014 14977 17333 17131 18304 21859 23178 23273 24848 25457 22892 25404
295 25404 31902 33714 29746 26925 26594 26182 29752 33693 36173 37851 35369 32692 31414 32484 31648 27048
279 27048 26556 29691 33982 35604 35047 32634 32810 36980 36987 34493 31516 27352 25636 27251 34349 44332
263 44332 44529 40417 38382 37444 35815 33720 36660 44090 48657 46103 44810 46035 45398 48601 51170 50866
247 50866 50152 48929 48708 46649 43085 40786 41391 45429 49434 49408 49260 47558 49894 56395 59111 59599 54451
230 54451 49468 50208 52815 50611 48759 50662 54534 56151 56795 57452 53506 48075 43257 39010 37049 41273
$$ packed form
344F034Q253N787L119J533m501I937D405Q43Q287Q001p9j222k424o038n820M3
328E996L659K153q40L773J619k711k782O40M395L655k02J040n75l177j999k501
312A2143n79P16K077M814R14m071j037K356k02J173L555J319R5J575O09k565K512
295B5404O498J812l968k821l31m12L570L941K480J678k482k677j278J070q36m600
279B7048m92L135M291J622n57k413J76M170Pk494k977m164j716J615P098R983
263D4332J97m112k035r38j629k095K940P430M567k554j293J225o37L203K569l04
247E0866p14j223k21k059l564k299O05M038M005k6j48j702K336O501K716M88n148
230E4451m983P40K607k204j852J903L872J617O44O57l946n431m818m247j961M224
$$ plain form
214 41273 50743 56482 55207 54431 52741 53638 56585 59513 62263 65332 68533 66031 62241 60635 59441
199 59441 61455 65503 66576 64424 66062 69239 70661 72309 76139 75534 73788 73922 74813 75412 77059 82025
183 82025 84809 83919 86889 89719 88619 88169 88072 89490 94497 95736 95007 93766 91265 89641 88538 87356
167 87356 84645 86129 89376 95596 100625 106065 108975 107932 106388 106141 107372 110263 109300 107159 106179 106251
151 106251 107175 110088 110877 113772 119823 119311 115408 114094 117858 121829 120977 122851 125748 125917 129103 133671
135 133671 138768 141533 140487 138874 136297 138228 144324 145997 144691 139683 133314 131110 134140 140478 143665
120 143665 145642 149776 154103 155619 153071 151713 151099 150379 152736 154997 157011 160322 163144 166268 170890
105 170890 175467 177305 174526 169787 167295 170117 177468 181478 176968 173747 176591 182179 189546 195232 197667
$$ packed form
214D1273R470N739j275p76j690Q97K947K928K750L069L201k502l790j606j194
199E9441K014M048J073k152J638L177J422J648L830o05j746J34Q91N99J647M966
183H2025K784q90K970K830j100m50r7J418N007J239p29j241k501j624j103j182
167H7356k711J484L247O220N029N440K910j043j544k47J231K891r63k141r80P2
151A06251R24K913P89K895O051n12l903j314L764L971q52J874K897J69L186M568
135A33671N097K765j046j613k577J931O096J673j306n008o369k204L030O338L187
120A43665J977M134M327J516k548j358o14p20K357K261K014L311K822L124M622
105A70890M577J838k779m739k492K822P351M010m510l221K844N588P367N686K435
$$ plain form
90 197667 200164 201321 200419 196851 194047 195953 200042 202273 198746 198015 201465 203705 205006 207390 209863
75 209863 210054 209539 212389 216412 215912 216095 222700 230066 233807 233352 231646 231939 233099 233468 234341 237564 239908
58 239908 239212 239933 241023 244753 250032 251650 252443 253785 256367 256685 257944 261054 263671 267081 271579 273652
42 273652 274446 279438 280066 276676 275114 273832 274280 277395 277977 279181 283524 288610 293602 297467 298313 299347
26 299347 300571 298749 298111 298272 297137 298426 302218 302007 300247 300540 304844 308858 311988 317042 319786 319465
10 319465 321498 324957 327626 330109 332287 333462 336143 338476 340304 341717
0 341717
$$ packed form
90A97667K497J157r02l568k804J906M089K231l527p31L450K240J301K384K473
75B09863J91n15K850M023n00J83O605P366L741m55j706K93J160L69Q73L223K344
58B39908o96P21J090L730N279J618P93J342K582L18J259L110K617L410M498K073
42B73652P94M992O28l390j562j282M48L115N82J204M343N086M992L865Q46J034
26B99347J224j822o38J61j135J289L792k11j760K93M304M014L130N054K744l21
10C19465K033L459K669K483K178J175K681K333J828J413
0C41717
$$ Imaginary data points
##PAGE= N=2
##DATA TABLE= (X++(I..I)), XYDATA
$$ plain form
16383 -1098962 -1081647 -1066036 -1053698 -1040647 -1028721 -1014629 -998614 -983064 -964231 -948323 -932572
16372 -932572 -917891 -902534 -887741 -873908 -857579 -840711 -828204 -814186 -795579 -779730 -763748
16361 -763748 -746546 -729786 -712323 -696884 -684567 -671895 -655355 -638191 -623134 -607920 -593636
16350 -593636 -582445 -569942 -559693 -547378 -533145 -516886 -502691 -491189 -477069 -458083 -438198
16339 -438198 -420159 -407375 -395915 -381656 -365231 -345845 -327832 -317331 -311217 -299198 -283415 -269059
16327 -269059 -255877 -242525 -227261 -211818 -196486 -181139 -167048 -154478 -140063 -125216 -113889
16316 -113889 -102997 -90119 -76039 -65871 -54639 -43066 -30669 -19934 -10369 5569 21642 34479
16304 34479 48038 63189 75756 86875 98134 108923 117072 127151 138915 152600 165972 180408
$$ packed form
16383a098962J7315J5611J2338J3051J1926J4092J6015J5550J8833J5908J5751
16372i32572J4681J5357J4793J3833J6329J6868J2507J4018J8607J5849J5982
16361g63748J7202J6760J7463J5439J2317J2672J6540J7164J5057J5214J4284
16350e93636J1191J2503J0249J2315J4233J6259J4195J1502J4120J8986J9885
16339d38198J8039J2784J1460J4259J6425J9386J8013J0501O114J2019J5783J4356
16327b69059J3182J3352J5264J5443J5332J5347J4091J2570J4415J4847J1327
16316a13889J0892J2878J4080J0168J1232J1573J2397J0735R565E569J6073J2837
16304C4479J3559J5151J2567J1119J1259J0789Q149J0079J1764J3685J3372J4436
$$ plain form
16292 180408 197720 213656 223626 233168 242647 252769 263817 273088 283660 296276 306871 318521
16280 318521 330677 345968 362672 377247 389646 398915 405281 414387 425204 438608 451774 461791
16268 461791 468195 472945 477710 486132 493367 499202 506516 517314 532647 547593 556532 564363 574921
16255 574921 587899 599479 605784 611643 616194 623900 633531 640968 648620 657151 669266 681441 692860
16242 692860 703121 711105 717654 725429 732397 738473 745923 755122 761692 766926 773948 781985 787308 794021
16228 794021 801832 808277 818016 826131 832652 838678 841649 848659 859070 867490 876424 888393 896413 899254
16214 899254 904801 911170 917088 920833 923804 930063 938258 944536 949764 952710 958795 964687 971131 977704
16200 977704 986367 991564 994098 1002449 1017059 1025626 1029209 1031493 1033283 1038889 1043543 1047697 1053634 1058356
$$ packed form
16292A80408J7312J5936R970R542R479J0122J1048R271J0572J2616J0595J1650
16280C18521J2156J5291J6704J4575J2399R269O366R106J0817J3404J3166J0017
16268D61791O404M750M765Q422P235N835P314J0798J5333J4946Q939P831J0558
16255E74921J2978J1580O305N859M551P706R631P437P652Q531J2115J2175J1419
16242F92860J0261P984O549P775O968O076P450R199O570N234P022Q037N323O713
16228G94021P811O445R739Q115O521O026K971P010J0411Q420Q934J1969Q020K841
16214H99254N547O369N918L745K971O259Q195O278N228K946O085N892O444O573
16200I77704Q663N197K534Q351J4610Q567L583K284J790N606M654M154N937M722
$$ plain form
16186 1058356 1062913 1065177 1069970 1080069 1091569 1099660 1104085 1102005 1100275 1103889 1109515 1114075 1113446 1116717
16172 1116717 1123846 1124758 1124602 1130825 1139622 1146444 1150340 1153257 1153906 1155852 1159014 1161438 1163110 1166517 1172820
16157 1172820 1182815 1188937 1188505 1185340 1184405 1186152 1188773 1188984 1189925 1193220 1198464 1205354 1209976 1210385 1213305
16142 1213305 1220848 1224553 1223981 1224480 1225326 1226789 1228251 1230453 1233780 1232219 1234269 1240401 1244977 1247937 1250229
16127 1250229 1254114 1253975 1252442 1253779 1257429 1262133 1266368 1270680 1273988 1276042 1276276 1277559 1281202 1281919 1280023
16112 1280023 1281439 1284115 1284070 1284077 1285726 1288391 1291811 1293647 1292046 1294339 1297887 1300811 1303291 1303777 1304550 1305387
16096 1305387 1307303 1307787 1309382 1315304 1318422 1313747 1306007 1302551 1301637 1300616 1301774 1307446 1310784 1314090
16082 1314090 1319542 1320856 1318450 1318347 1316800 1315518 1316272 1318330 1319825 1320810 1322730 1320093 1317434 1316659 1318043
$$ packed form
16186A058356M557K264M793J0099J1500Q091M425k080j730L614N626M560o29L271
16172A116717P129R12j56O223Q797O822L896K917O49J946L162K424J672L407O303
16157A172820R995O122m32l165r35J747K621K11R41L295N244O890M622M09K920
16142A213305P543L705n72M99Q46J463J462K202L327j561K050O132M576K960K292
16127A250229L885j39j533J337L650M704M235M312L308K054K34J283L643P17j896
16112A280023J416K676m5PJ649K665L420J836j601K293L548K924K480M86P73Q37
16096A305387J916M84J595N922L118m675p740l456r14j021J158N672L338L306
16082A314090N452J314k406j03j547j282P54K058J495R85J920k637k659p75J384
$$ plain form
16067 1318043 1323019 1328139 1334504 1338728 1340465 1338025 1334954 1334351 1331194 1327796 1325769 1324715 1324470 1325800
16053 1325800 1322572 1321435 1323634 1325675 1327983 1330779 1333295 1336717 1338431 1340445 1343043 1342161 1344723 1351056
16039 1351056 1352785 1350961 1345265 1337657 1332009 1333731 1335923 1338919 1339483 1338853 1338258 1342423 1343811 1343575 1344086
16024 1344086 1346668 1347260 1347103 1348334 1348782 1346950 1343625 1341337 1341017 1346647 1354759 1358533 1357070 1354898 1350192
16009 1350192 1343647 1343082 1346650 1349373 1352632 1353653 1351891 1350443 1351419 1352404 1347151 1341586 1341478 1345452 1350616
15994 1350616 1356315 1358593 1360016 1360241 1357062 1349475 1346364 1346007 1347571 1350415 1354553 1354421 1351970 1351518 1353121
15979 1353121 1354367 1355497 1355409 1349376 1348422 1355107 1363592 1365046 1361639 1358244 1355524 1352146 1353252 1357884 1360331
15964 1360331 1362469 1362420 1361298 1360529 1362174 1367006 1367777 1367651 1366863 1361018 1356003 1353889 1353512 1354389 1352124 1346999
$$ packed form
16067A318043M976N120O365M224J737k440l071o03l157l398k027j054k45J330
16053A325800l228j137K199K041K308K796K516L422J714K014K598q82K562O333
16039A351056J729j824n696p608n648J722K192K996N64o30n95M165J388k36N11
16024A344086K582N92j57J231M48j832l325k288l20N630Q112L774j463k172m706
16009A350192o545n65L568K723L259J021j762j448R76R85n253n565j08L974N164
15994A350616N699K278J423K25l179p587l111l57J564K844M138j32k451m52J603
15979A353121J246J130q8o033r54O685Q485J454l407l395k720l378J106M632K447
15964A360331K138m9j122p69J645M832P71j26p88n845n015k114l77Q77k265n125
$$ plain form
15948 1346999 1344950 1343880 1344465 1346351 1349319 1355646 1359289 1358301 1356178 1353629 1353367 1355855 1357921 1358168 1360078
15933 1360078 1361814 1361504 1362462 1365418 1369489 1370643 1368830 1366045 1361330 1360506 1360057 1359850 1359253 1356070 1356735 1359800
15917 1359800 1358949 1358065 1360569 1360844 1358055 1357968 1355986 1355282 1357406 1360911 1363352 1359364 1354967 1355157 1355937 1361250
15901 1361250 1367223 1369032 1366804 1362902 1361871 1361471 1362828 1363913 1363972 1362342 1361040 1361748 1361604 1359300 1359652
15886 1359652 1359924 1359656 1361075 1361750 1357369 1352437 1354035 1359064 1362574 1363133 1364410 1362882 1360015 1362012 1366745
15871 1366745 1371565 1368582 1365562 1363739 1364077 1366307 1362019 1358646 1358272 1360860 1364675 1363069 1358860 1358118 1360603
15856 1360603 1364987 1368897 1369761 1371688 1371370 1372108 1369173 1363539 1360754 1362050 1366180 1370509 1374761 1372737 1367938
15841 1367938 1367068 1368668 1366827 1365776 1362401 1364104 1370936 1376279 1378309 1377442 1374489 1372892 1373296 1376277 1374398
$$ packed form
15948A346999k049j070N85J886K968O327L643r88k123k549k62K488K066K47J910
15933A360078J736l10R58K956M071J154j813k785m715q24m49k07n97l183O65L065
15917A359800q51q84K504K75k789q7j982p04K124L505K441l988m397J90P80N313
15901A361250N973J809k228l902j031m00J357J085N9j630j302P08j44k304L52
15886A359652K72k68J419O75m381m932J598N029L510N59J277j528k867J997M733
15871A366745M820k983l020j823L38K230m288l373l74K588L815j606m209p42K485
15856A360603M384L910Q64J927l18P38k935n634k785J296M130M329M252k024m799
15841A367938q70J600j841j051l375J703O832N343K030q67k953j597M04K981j879
$$ plain form
15826 1374398 1370898 1370590 1373756 1374809 1376615 1380858 1386710 1391184 1387317 1376971 1369422 1362955 1361906 1366824
15812 1366824 1371576 1370975 1368820 1371651 1373153 1374610 1375987 1375721 1375079 1373588 1380063 1386635 1386373 1383063 1380023
15797 1380023 1376515 1371748 1369283 1369053 1373575 1377696 1381257 1383622 1381317 1379723 1378052 1371939 1366753 1366551
15783 1366551 1369660 1373034 1376194 1377600 1374098 1369838 1366968 1367832 1367822 1369964 1372821 1374142 1375607 1375178 1372778
15768 1372778 1371845 1368155 1369653 1371030 1369251 1370520 1374988 1375842 1375960 1378398 1381713 1388164 1394521 1393615 1389052
15753 1389052 1386655 1382615 1374528 1370099 1366713 1367297 1375330 1383387 1387392 1384269 1379887 1380516 1381248 1379696 1373115
15738 1373115 1370049 1371423 1372184 1373719 1375578 1376096 1377249 1379443 1381532 1384324 1386375 1385469 1378676 1374545 1378434
15723 1378434 1380681 1380641 1379423 1375914 1375547 1379157 1376863 1377226 1376405 1374255 1370652 1365760 1363341 1367070 1373922
$$ packed form
15826A374398l500l08L166J053J806M243N852M474l867j0346p549o467j049M918
15812A366824M752o01k155K831J502J457J377k66o42j491O475O572k62l310l040
15797A380023l508m767k465k30M522M121L561K365k305j594j671o113n186k02
15783A366551L109L374L160J406l502m260k870Q64j0K142K857J321J465m29k400
15768A372778r33l690J498J377j779J269M468Q54J18K438L315O451O357r06m563
15753A389052k397m040q087m429l386N84Q033Q057M005l123m382O29P32j552o581
15738A373115l066J374P61J535J859N18J153K194K089K792K051r06o793m131L889
15723A378434K247m0j218l509l67L610k294L63q21k150l603m892k419L729O852
$$ plain form
15708 1373922 1379750 1385269 1385416 1385850 1386466 1386001 1385415 1385778 1384752 1385258 1384205 1384307 1385655 1387497 1388235 1385976
15692 1385976 1384317 1380105 1374689 1375682 1382979 1392996 1396214 1391443 1388755 1386953 1388508 1389900 1389283 1386206
15678 1386206 1386579 1388910 1388829 1388021 1385720 1380448 1381993 1387904 1392188 1396981 1399131 1397533 1391575 1389549 1393343
15663 1393343 1396260 1398446 1395947 1392679 1389859 1389189 1388997 1389152 1393868 1399353 1397958 1393039 1392126 1389735 1385737
15648 1385737 1386587 1387074 1387923 1388237 1387538 1386884 1388357 1390085 1392404 1393539 1395561 1398151 1397309 1393556 1392045 1393970
15632 1393970 1398153 1400646 1397579 1392090 1393643 1396190 1396431 1393069 1395072 1397502 1395858 1398062 1398687 1395931
15618 1395931 1392426 1390019 1385173 1383567 1387021 1391360 1391831 1394561 1393286 1389253 1391125 1395621 1393523 1393813
15604 1393813 1395663 1390978 1387926 1390004 1392604 1397281 1400757 1400314 1399479 1401283 1406276 1411417 1413852 1412261
$$ packed form
15708A373922N828N519J47M34O16m65n86L63j026N06j053J02J348J842P38k259
15692A385976j659m212n416R93P297J0017L218m771k688j802J555J392o17l077
15678A386206L73K331q1q08k301n272J545N911M284M793K150j598n958k026L794
15663A393343K917K186k499l268k820o70j92J55M716N485j395m919r13k391l998
15648A385737Q50M87Q49L14o99o54J473J728K319J135K022K590q42l753j511J925
15632A393970M183K493l067n489J553K547K41l362K003K430j644K204O25k756
15618A395931l505k407m846j606L454M339M71K730j275m033J872M496k098K90
15604A393813J850m685l052K078K600M677L476m43q35J804M993N141K435j591
$$ plain form
15590 1412261 1410242 1408260 1408093 1404892 1402055 1404549 1405903 1406272 1406881 1405992 1403756 1401605 1402036 1402552 1403912
15575 1403912 1406645 1409082 1410497 1406808 1397660 1395943 1401686 1404873 1402891 1405956 1413117 1413584 1410156 1404357
15561 1404357 1401803 1401688 1397959 1395368 1393383 1393971 1392275 1387846 1389296 1394165 1396477 1394106 1392283 1392327 1394841
15546 1394841 1402603 1406162 1404822 1401701 1399460 1397694 1398069 1399175 1403937 1406435 1408573 1408179 1404944 1403988 1406445
15531 1406445 1411458 1413500 1410720 1409376 1409599 1408902 1406415 1402212 1404002 1409320 1410570 1412413 1413578 1412912 1407098
15516 1407098 1400337 1397061 1399856 1405089 1413811 1419115 1420066 1419415 1420650 1416346 1408995 1409268 1414287 1413735 1410947
15501 1410947 1409729 1405544 1403890 1403506 1404847 1402611 1402718 1405612 1406485 1408436 1408092 1405220 1400982 1398031 1395549
$$ packed form
15590A412261k019j982j67l201k837K494J354L69O09q89k236k151M31N16J360
15575A403912K733K437J415l689r148j717N743L187j982L065P161M67l428n799
15561A404357k554j15l729k591j985N88j696m429J450M869K312k371j823M4K514
15546A394841P762L559j340l121k241j766L75J106M762K498K138l94l235r56K457
15531A406445N013K042k780j344K23o97k487m203J790N318J250J843J165o66n814
15516A407098o761l276K795N233Q722N304R51o51J235m304p351K73N019n52k788
15501A410947j218m185j654l84J341k236J07K894Q73J951l44k872m238k951k482
$$ [...]
##END NTUPLES=NMR SPECTRUM
##END=
